Hexanedinitrile
- Formula: C6H8N2
- Molecular weight: 108.1411
- IUPAC Standard InChIKey: BTGRAWJCKBQKAO-UHFFFAOYSA-N
- CAS Registry Number: 111-69-3
- Chemical structure:
View 3d structure (requires JavaScript / HTML 5) - Other names: Adiponitrile; Adipic acid dinitrile; Adipic acid nitrile; Adipodinitrile; 1,4-Dicyanobutane; Hexanedioic acid dinitrile; Tetramethylene dicyanide; Adipyldinitrile; Nitrile adipico; Tetramethylene cyanide; UN 2205; NSC 7617; Adipic dinitrile

Gas phase thermochemistry data

Data compiled by: Hussein Y. Afeefy, Joel F. Liebman, and Stephen E. Stein
Quantity | Value | Units | Method | Reference | Comment |
---|---|---|---|---|---|
ΔfH°gas | 149. ± 2. | kJ/mol | Ccb | Lebedeva and Katin, 1973 | Heat of combustion is not reported |

Condensed phase thermochemistry data

Data compiled by: Hussein Y. Afeefy, Joel F. Liebman, and Stephen E. Stein
Quantity | Value | Units | Method | Reference | Comment |
---|---|---|---|---|---|
ΔfH°liquid | 84.9 ± 0.4 | kJ/mol | Ccb | Lebedeva and Katin, 1973 | Heat of combustion is not reported |

Phase change data

Data compiled as indicated in comments:
BS - Robert L. Brown and Stephen E. Stein
TRC - Thermodynamics Research Center, NIST Boulder Laboratories, Chris Muzny director
ALS - Hussein Y. Afeefy, Joel F. Liebman, and Stephen E. Stein
DRB - Donald R. Burgess, Jr.
AC - William E. Acree, Jr., James S. Chickos
Quantity | Value | Units | Method | Reference | Comment |
---|---|---|---|---|---|
Tboil | 568.2 | K | N/A | Weast and Grasselli, 1989 | BS |
Quantity | Value | Units | Method | Reference | Comment |
Tfus | 275. ± 1. | K | AVG | N/A | Average of 8 values; Individual data points |
Quantity | Value | Units | Method | Reference | Comment |
ΔvapH° | 64. ± 1. | kJ/mol | V | Lebedeva and Katin, 1973 | Heat of combustion is not reported; ALS |
ΔvapH° | 64.1 | kJ/mol | N/A | Lebedeva and Katin, 1973 | DRB |
Enthalpy of vaporization
ΔvapH (kJ/mol) | Temperature (K) | Method | Reference | Comment |
---|---|---|---|---|
58.7 | 363. | A | Stephenson and Malanowski, 1987 | Based on data from 348. to 523. K.; AC |
Enthalpy of fusion
ΔfusH (kJ/mol) | Temperature (K) | Method | Reference | Comment |
---|---|---|---|---|
18.0 | 275. | DSC | Badea, Blanco, et al., 2007 | AC |

Normal alkane RI, non-polar column, temperature ramp

Column type | Active phase | I | Reference | Comment |
---|---|---|---|---|
Capillary | OV-101 | 1090. | Zenkevich, 2005 | 25. m/0.20 mm/0.10 μm, N2/He, 6. K/min; Tstart: 50. C; Tend: 250. C |

References

Lebedeva and Katin, 1973
Lebedeva, N.D.; Katin, Yu.A.,
Heats of combustion of oenanthonitrile, adiponitrile, and tetramethylsuccinodinitrile,
Russ. J. Phys. Chem. (Engl. Transl.), 1973, 47, 922. [all data]
Weast and Grasselli, 1989
CRC Handbook of Data on Organic Compounds, 2nd Editon, Weast,R.C and Grasselli, J.G., ed(s)., CRC Press, Inc., Boca Raton, FL, 1989, 1. [all data]
Stephenson and Malanowski, 1987
Stephenson, Richard M.; Malanowski, Stanislaw,
Handbook of the Thermodynamics of Organic Compounds, 1987, https://doi.org/10.1007/978-94-009-3173-2
. [all data]
Badea, Blanco, et al., 2007
Badea, Elena; Blanco, Ignazio; Della Gatta, Giuseppe,
Fusion and solid-to-solid transitions of a homologous series of alkane-α,ω-dinitriles,
The Journal of Chemical Thermodynamics, 2007, 39, 10, 1392-1398, https://doi.org/10.1016/j.jct.2007.03.005
. [all data]
Zenkevich, 2005
Zenkevich, I.G.,
Experimentally measured retention indices., 2005. [all data]