1-Heptanamine
- Formula: C7H17N
- Molecular weight: 115.2166
- IUPAC Standard InChIKey: WJYIASZWHGOTOU-UHFFFAOYSA-N
- CAS Registry Number: 111-68-2
- Chemical structure:
View 3d structure (requires JavaScript / HTML 5) - Other names: Heptylamine; n-Heptylamine; 1-Aminoheptane; CH3(CH2)6NH2; 1-Heptylamine

Gas phase thermochemistry data

Data compiled by: Donald R. Burgess, Jr.
Quantity | Value | Units | Method | Reference | Comment |
---|---|---|---|---|---|
ΔfH°gas | -216.0 | kJ/mol | N/A | Lemoult, 1907 | Value computed using ΔfHliquid° value of -266 kj/mol from Lemoult, 1907 and ΔvapH° value of 49.96±0.08 kj/mol from missing citation. |

Condensed phase thermochemistry data

Data compiled by: Hussein Y. Afeefy, Joel F. Liebman, and Stephen E. Stein
Quantity | Value | Units | Method | Reference | Comment |
---|---|---|---|---|---|
ΔfH°liquid | -266. | kJ/mol | Ccb | Lemoult, 1907 | |
Quantity | Value | Units | Method | Reference | Comment |
ΔcH°liquid | -4949.7 | kJ/mol | Ccb | Lemoult, 1907 |

Phase change data

Data compiled as indicated in comments:
BS - Robert L. Brown and Stephen E. Stein
TRC - Thermodynamics Research Center, NIST Boulder Laboratories, Chris Muzny director
AC - William E. Acree, Jr., James S. Chickos
ALS - Hussein Y. Afeefy, Joel F. Liebman, and Stephen E. Stein
Quantity | Value | Units | Method | Reference | Comment |
---|---|---|---|---|---|
Tboil | 429. ± 3. | K | AVG | N/A | Average of 11 values; Individual data points |
Quantity | Value | Units | Method | Reference | Comment |
Tfus | 250.15 | K | N/A | Timmermans and Mattaar, 1921 | Uncertainty assigned by TRC = 0.6 K; TRC |
Quantity | Value | Units | Method | Reference | Comment |
ΔvapH° | 49.98 | kJ/mol | N/A | Majer and Svoboda, 1985 | |
ΔvapH° | 49.9 | kJ/mol | CGC | Chickos, Hosseini, et al., 1995 | Based on data from 323. to 373. K.; AC |
ΔvapH° | 50.0 ± 0.1 | kJ/mol | C | Wadsö, Heikkilä, et al., 1969 | AC |
ΔvapH° | 49.96 ± 0.08 | kJ/mol | C | Wadso, 1969 | ALS |
Enthalpy of vaporization
ΔvapH (kJ/mol) | Temperature (K) | Method | Reference | Comment |
---|---|---|---|---|
46.5 | 341. | A | Stephenson and Malanowski, 1987 | Based on data from 326. to 430. K.; AC |

Gas phase ion energetics data

Data evaluated as indicated in comments:
HL - Edward P. Hunter and Sharon G. Lias
Data compiled as indicated in comments:
MM - Michael M. Meot-Ner (Mautner)
Quantity | Value | Units | Method | Reference | Comment |
---|---|---|---|---|---|
Proton affinity (review) | 923.2 | kJ/mol | N/A | Hunter and Lias, 1998 | HL |
Quantity | Value | Units | Method | Reference | Comment |
Gas basicity | 889.3 | kJ/mol | N/A | Hunter and Lias, 1998 | HL |
Gas basicity at 298K
Gas basicity (review) (kJ/mol) | Reference | Comment |
---|---|---|
879.5 ± 9.2 | Gross, Rodriguez-Cruz, et al., 1995 | T = 300K; 3-Fluoropyridine; i-Propylamine. Reference GBs readjusted to Hunter and Lias, 1998. Cited uncertainty is half of the ΔGB between the bracketing bases; MM |

Kovats' RI, non-polar column, isothermal

Data compiled by: NIST Mass Spectrometry Data Center, William E. Wallace, director

Column type CapillaryCapillaryPackedCapillaryCapillary
Active phase OV-101OV-101ApolaneApiezon LH + KFApiezon LH + KF
Column length (m) 20.20.3.730.30.
Carrier gas    HeHe
Substrate
Column diameter (mm) 0.50.5 0.250.25
Phase thickness (μm)    0.0630.063
Temperature (C) 150.180.130.100.100.
I 928.0943.2918.932.932.
ReferenceCha and Lee, 1994Cha and Lee, 1994Dutoit, 1991Samusenko, Svetlova, et al., 1986Samusenko, Svetlova, et al., 1986
Comment MSDC-RI MSDC-RI MSDC-RI MSDC-RI MSDC-RI
Column type CapillaryCapillaryCapillaryCapillaryCapillary
Active phase Apiezon LH + KFApiezon LH + KFApiezon LH + KFApiezon LH + KFApiezon LH + KF
Column length (m) 30.30.30.30.30.
Carrier gas HeHeHeHeHe
Substrate
Column diameter (mm) 0.250.250.250.250.25
Phase thickness (μm) 0.0630.0630.0630.0630.063
Temperature (C) 100.100.100.100.100.
I 933.933.934.934.935.
ReferenceSamusenko, Svetlova, et al., 1986Samusenko, Svetlova, et al., 1986Samusenko, Svetlova, et al., 1986Samusenko, Svetlova, et al., 1986Samusenko, Svetlova, et al., 1986
Comment MSDC-RI MSDC-RI MSDC-RI MSDC-RI MSDC-RI
Column type CapillaryCapillaryCapillaryCapillaryCapillary
Active phase Apiezon L + KFApiezon L + KFApiezon L + KFApiezon L + KFApiezon L + KF
Column length (m) 30.30.30.30.30.
Carrier gas HeHeHeHeHe
Substrate
Column diameter (mm) 0.250.250.250.250.25
Phase thickness (μm) 0.0630.0630.0630.0630.063
Temperature (C) 100.100.100.100.100.
I 930.931.932.932.932.
ReferenceSamusenko, Svetlova, et al., 1986Samusenko, Svetlova, et al., 1986Samusenko, Svetlova, et al., 1986Samusenko, Svetlova, et al., 1986Samusenko, Svetlova, et al., 1986
Comment MSDC-RI MSDC-RI MSDC-RI MSDC-RI MSDC-RI
Column type CapillaryCapillaryCapillaryCapillaryCapillary
Active phase Apiezon L + KFApiezon L + KFApiezon L + KFApiezon L + KFApiezon L + KF
Column length (m) 30.30.30.30.30.
Carrier gas HeHe
Substrate
Column diameter (mm) 0.250.250.250.250.25
Phase thickness (μm) 0.0630.0630.060.060.06
Temperature (C) 100.100.100.100.100.
I 933.933.931.932.933.
ReferenceSamusenko, Svetlova, et al., 1986Samusenko, Svetlova, et al., 1986Svetlova, Samusenko, et al., 1986Svetlova, Samusenko, et al., 1986Svetlova, Samusenko, et al., 1986
Comment MSDC-RI MSDC-RI MSDC-RI MSDC-RI MSDC-RI
Column type CapillaryCapillaryCapillaryPackedPacked
Active phase Apiezon L + KFApiezon L + KFApiezon L + KFSE-30PMS-100
Column length (m) 30.30.30.3.3.
Carrier gas    N2He
Substrate    Chromosorb A AWCelite 545 (44-60 mesh)
Column diameter (mm) 0.250.250.25
Phase thickness (μm) 0.060.060.06
Temperature (C) 100.100.100.180.130.
I 933.934.935.939.931.
ReferenceSvetlova, Samusenko, et al., 1986Svetlova, Samusenko, et al., 1986Svetlova, Samusenko, et al., 1986Oszczapowicz, Osek, et al., 1985Anderson, Jurel, et al., 1973
Comment MSDC-RI MSDC-RI MSDC-RI MSDC-RI MSDC-RI
Column type PackedPackedPackedPacked
Active phase PMS-100PMS-100Apiezon LApiezon L
Column length (m) 3.3. 2.26
Carrier gas HeHe
Substrate Celite 545 (44-60 mesh)Celite 545 (44-60 mesh) Teflon-Haloport
Column diameter (mm)
Phase thickness (μm)
Temperature (C) 150.180.100.130.
I 931.930.942.912.
ReferenceAnderson, Jurel, et al., 1973Anderson, Jurel, et al., 1973Golovnya and Zhuravleva, 1973Landault and Guiochon, 1964
Comment MSDC-RI MSDC-RI MSDC-RI MSDC-RI

Van Den Dool and Kratz RI, non-polar column, custom temperature program

Data compiled by: NIST Mass Spectrometry Data Center, William E. Wallace, director

Column type CapillaryCapillaryPacked
Active phase DB-1Methyl SiliconeSE-30
Column length (m) 15. 3.05
Carrier gas He
Substrate   Supelcoport; Chromosorb
Column diameter (mm) 0.53
Phase thickness (μm) 1.
Program 40C(3min) => 8C/min => 200(1min) => 5C/min => 300C(25min)not specified40C(5min) => 10C/min => 200C or 250C (60min)
I 930.937.941.
ReferencePeng, 2000Peng, Yang, et al., 1991Peng, Ding, et al., 1988
Comment MSDC-RI MSDC-RI MSDC-RI

Normal alkane RI, non-polar column, isothermal

Data compiled by: NIST Mass Spectrometry Data Center, William E. Wallace, director

Column type CapillaryCapillaryCapillaryCapillary
Active phase Methyl SiliconeMethyl SiliconeMethyl SiliconeMethyl Silicone
Column length (m)
Carrier gas
Substrate
Column diameter (mm)
Phase thickness (μm)
Temperature (C) 100.120.140.80.
I 933.934.935.932.
ReferenceLebrón-Aguilar, Quintanilla-López, et al., 2007Lebrón-Aguilar, Quintanilla-López, et al., 2007Lebrón-Aguilar, Quintanilla-López, et al., 2007Lebrón-Aguilar, Quintanilla-López, et al., 2007
Comment MSDC-RI MSDC-RI MSDC-RI MSDC-RI

References

Lemoult, 1907
Lemoult, M.P.,
Recherches theoriques et experimentales sur les chaleurs de combustion et de formation des composes organiques,
Ann. Chim. Phys., 1907, 12, 395-432. [all data]
Timmermans and Mattaar, 1921
Timmermans, J.; Mattaar, J.F.,
Freezing points of orgainic substances VI. New experimental determinations.,
Bull. Soc. Chim. Belg., 1921, 30, 213. [all data]
Majer and Svoboda, 1985
Majer, V.; Svoboda, V.,
Enthalpies of Vaporization of Organic Compounds: A Critical Review and Data Compilation, Blackwell Scientific Publications, Oxford, 1985, 300. [all data]
Chickos, Hosseini, et al., 1995
Chickos, James S.; Hosseini, Sarah; Hesse, Donald G.,
Determination of vaporization enthalpies of simple organic molecules by correlations of changes in gas chromatographic net retention times,
Thermochimica Acta, 1995, 249, 41-62, https://doi.org/10.1016/0040-6031(95)90670-3
. [all data]
Wadsö, Heikkilä, et al., 1969
Wadsö, Ingemar; Heikkilä, Jussi; Beagley, B.; Aalto, Tarja; Werner, Per-Erik; Junggren, Ulf; Lamm, Bo; Samuelsson, Benny,
Enthalpies of Vaporization of Organic Compounds. III. Amines.,
Acta Chem. Scand., 1969, 23, 2061-2064, https://doi.org/10.3891/acta.chem.scand.23-2061
. [all data]
Wadso, 1969
Wadso, I.,
Enthalpies of vaporization of organic compounds,
Acta Chem. Scand., 1969, 23, 2061. [all data]
Stephenson and Malanowski, 1987
Stephenson, Richard M.; Malanowski, Stanislaw,
Handbook of the Thermodynamics of Organic Compounds, 1987, https://doi.org/10.1007/978-94-009-3173-2
. [all data]
Hunter and Lias, 1998
Hunter, E.P.; Lias, S.G.,
Evaluated Gas Phase Basicities and Proton Affinities of Molecules: An Update,
J. Phys. Chem. Ref. Data, 1998, 27, 3, 413-656, https://doi.org/10.1063/1.556018
. [all data]
Gross, Rodriguez-Cruz, et al., 1995
Gross, D.S.; Rodriguez-Cruz, S.E.; Bock, S.; Williams, E.R.,
Measurement of the Coulomb Energy and Dielectric Polarizability of Gas-Phase Diprotonated Diaminoalkanes,
J. Phys. Chem., 1995, 99, 4034. [all data]