Tri(pentylthio)borane

Phase change data

Data compiled by: William E. Acree, Jr., James S. Chickos

Quantity Value Units Method Reference Comment
Δvap104.6 ± 2.1kJ/molN/AFinch, Gardner, et al., 1967Based on data from 446. - 503. K.

Enthalpy of vaporization

ΔvapH (kJ/mol) Temperature (K) Reference Comment
92.3474.Finch, Gardner, et al., 1967Based on data from 446. - 503. K.

References

Finch, Gardner, et al., 1967
Finch, Arthur; Gardner, P.J.; Pearn, E.J.; Watts, G.B., Thermochemistry of triphenylboron, tricyclohexylboron and some phenylboron halides, Trans. Faraday Soc., 1967, 63, 1880, https://doi.org/10.1039/tf9676301880 . [all data]