2-Octene
- Formula: C8H16
- Molecular weight: 112.2126
- IUPAC Standard InChIKey: ILPBINAXDRFYPL-UHFFFAOYSA-N
- CAS Registry Number: 111-67-1
- Chemical structure:
View 3d structure (requires JavaScript / HTML 5) - Stereoisomers:
- Other names: Octene-2; 2-Octene (mixed cis, trans isomers); Oct-2-ene

Condensed phase thermochemistry data

Data compiled by: Eugene S. Domalski and Elizabeth D. Hearing
Constant pressure heat capacity of liquid
Cp,liquid (J/mol*K) | Temperature (K) | Reference | Comment |
---|---|---|---|
239.3 | 298. | von Reis, 1881 | T = 291 to 365 K. |

Phase change data

Data compiled by: Thermodynamics Research Center, NIST Boulder Laboratories, Chris Muzny director
Quantity | Value | Units | Method | Reference | Comment |
---|---|---|---|---|---|
Tboil | 398. ± 1. | K | AVG | N/A | Average of 16 values; Individual data points |
Quantity | Value | Units | Method | Reference | Comment |
Tfus | 179. | K | N/A | Boord, Henne, et al., 1949 | Uncertainty assigned by TRC = 2. K |
Tfus | 179.11 | K | N/A | Anonymous, 1941 | Uncertainty assigned by TRC = 0.2 K |
Tfus | 179.11 | K | N/A | Henne, Chanan, et al., 1941 | Uncertainty assigned by TRC = 0.3 K |

Kovats' RI, non-polar column, isothermal

Column type | Active phase | Temperature (C) | I | Reference | Comment |
---|---|---|---|---|---|
Packed | Squalane | 100. | 805. | Nabivach and Kirilenko, 1980 | He, Chromaton N-AW-HMDS; Column length: 1. m |
Capillary | Squalane | 40. | 802.5 | Schomburg and Dielmann, 1973 | Column length: 100. m; Column diameter: 0.25 mm |

Kovats' RI, non-polar column, temperature ramp

Column type | Active phase | I | Reference | Comment |
---|---|---|---|---|
Capillary | SE-54 | 813. | Rembold, Wallner, et al., 1989 | 30. m/0.25 mm/0.25 μm, He, 0. C @ 12. min, 12. K/min; Tend: 250. C |

Kovats' RI, non-polar column, custom temperature program

Column type | Active phase | I | Reference | Comment |
---|---|---|---|---|
Capillary | Petrocol DH-100 | 804.4 | Haagen-Smit Laboratory, 1997 | He; Column length: 100. m; Column diameter: 0.2 mm; Program: 5C(10min) => 5C/min => 50C(48min) => 1.5C/min => 195C(91min) |

Van Den Dool and Kratz RI, non-polar column, temperature ramp

Column type | Active phase | I | Reference | Comment |
---|---|---|---|---|
Capillary | RTX-5 | 799. | Ádámová, Orinák, et al., 2005 | 30. m/0.25 mm/0.25 μm, N2, 40. C @ 2. min, 5. K/min, 300. C @ 10. min |
Capillary | HP-5 | 817. | Insausti, Goñi, et al., 2005 | 50. m/0.32 mm/1.05 μm, He, 35. C @ 15. min, 8. K/min, 220. C @ 5. min |
Capillary | CP-Sil 8CB-MS | 812. | Hierro, de la Hoz, et al., 2004 | 60. m/0.25 mm/0.25 μm, 40. C @ 2. min, 4. K/min, 280. C @ 5. min |
Capillary | SPB-1 | 811. | Larráyoz, Addis, et al., 2001 | 30. m/0.32 mm/4. μm, He, 45. C @ 13. min, 5. K/min, 240. C @ 5. min |

Van Den Dool and Kratz RI, non-polar column, custom temperature program

Column type | Active phase | I | Reference | Comment |
---|---|---|---|---|
Packed | SE-30 | 827. | Peng, Ding, et al., 1988 | Supelcoport; Chromosorb; Column length: 3.05 m; Program: 40C(5min) => 10C/min => 200C or 250C (60min) |

Van Den Dool and Kratz RI, polar column, temperature ramp

Column type | Active phase | I | Reference | Comment |
---|---|---|---|---|
Capillary | DB-Wax | 858. | Malliaa, Fernandez-Garcia, et al., 2005 | 60. m/0.32 mm/1. μm, He, 45. C @ 1. min, 5. K/min, 250. C @ 12. min |
Capillary | Supelcowax-10 | 850. | Tanchotikul and Hsieh, 1989 | 60. m/0.25 mm/0.25 μm, 40. C @ 5. min, 2. K/min, 175. C @ 20. min |
Capillary | Supelcowax-10 | 854. | Tanchotikul and Hsieh, 1989 | 60. m/0.25 mm/0.25 μm, 40. C @ 5. min, 2. K/min, 175. C @ 20. min |

Van Den Dool and Kratz RI, polar column, custom temperature program

Column type | Active phase | I | Reference | Comment |
---|---|---|---|---|
Capillary | Supelcowax-10 | 848. | Bianchi, Careri, et al., 2007 | 30. m/0.25 mm/0.25 μm, He; Program: 40C(1min) => 10C/min => 120C => 15C/min => 200C (1min) |
Capillary | Supelcowax-10 | 843. | Bianchi, Careri, et al., 2007 | 30. m/0.25 mm/0.25 μm, He; Program: 35C(8min) => 4C/min => 60C => 6C/min => 160C => 20C/min => 200C(1min) |
Capillary | Supelcowax-10 | 842. | Bianchi, Careri, et al., 2007 | 30. m/0.25 mm/0.25 μm, He; Program: 35C(8min) => 4C/min => 60C => 6C/min => 160C => 20C/min => 200C(1min) |
Capillary | Supelcowax-10 | 846. | Bianchi, Careri, et al., 2007 | 30. m/0.25 mm/0.25 μm, He; Program: 35C(8min) => 4C/min => 60C => 6C/min => 160C => 20C/min => 200C(1min) |

Normal alkane RI, non-polar column, temperature ramp

Column type | Active phase | I | Reference | Comment |
---|---|---|---|---|
Capillary | HP-5 | 810. | Mildner-Szkudlarz and Jelen, 2008 | 10. m/0.10 mm/0.40 μm, Helium, 40. C @ 1. min, 20. K/min, 280. C @ 1. min |
Capillary | MDN-5 | 810. | Mildner-Szkudlarz, Jelen, et al., 2003 | 30. m/0.25 mm/0.25 μm, He, 40. C @ 1. min, 20. K/min, 280. C @ 1. min |
Capillary | SPB-5 | 806. | Sebastian, Viallon-Fernandez, et al., 2003 | 60. m/0.32 mm/1.0 μm, Helium, 3. K/min; Tstart: 30. C; Tend: 230. C |
Capillary | SPB-1 | 810. | Vichi, Pizzale, et al., 2003 | 30. m/0.25 mm/0.25 μm, He, 40. C @ 10. min, 3. K/min; Tend: 200. C |
Capillary | HP-5 | 815. | García, Martín, et al., 2000 | 60. m/0.32 mm/1. μm, He, 3. K/min; Tstart: 40. C; Tend: 240. C |
Capillary | DB-1 | 812. | Ciccioli, Cecinato, et al., 1992 | 60. m/0.32 mm/1.2 μm, He, 30. C @ 10. min, 3. K/min; Tend: 240. C |

Normal alkane RI, non-polar column, custom temperature program

Column type | Active phase | I | Reference | Comment |
---|---|---|---|---|
Capillary | RTX-5 | 805. | Ádámová, Orinák, et al., 2005 | 30. m/0.25 mm/0.25 μm, N2; Program: not specified |
Capillary | SE-30 | 811. | Vinogradov, 2004 | Program: not specified |
Capillary | Methyl phenyl siloxane (not specified) | 815. | Poligne, Collignan, et al., 2002 | Program: not specified |

Normal alkane RI, polar column, temperature ramp

Column type | Active phase | I | Reference | Comment |
---|---|---|---|---|
Capillary | DB-Wax | 860. | Ganeko, Shoda, et al., 2008 | 4. K/min; Column length: 60. m; Column diameter: 0.35 mm; Tstart: 40. C; Tend: 200. C |
Capillary | Supelcowax-10 | 864. | Vichi, Pizzale, et al., 2003 | 30. m/0.25 mm/0.25 μm, He, 40. C @ 10. min, 3. K/min; Tend: 200. C |

Normal alkane RI, polar column, custom temperature program

Column type | Active phase | I | Reference | Comment |
---|---|---|---|---|
Capillary | Supelcowax-10 | 843. | Berard, Bianchi, et al., 2007 | 30. m/0.25 mm/0.25 μm, He; Program: 35C(8min) => 6C/min => 60C => 4C/min => 160C => 20C/min => 200C(1min) |
Capillary | Supelcowax-10 | 846. | Berard, Bianchi, et al., 2007 | 30. m/0.25 mm/0.25 μm, He; Program: 35C(8min) => 6C/min => 60C => 4C/min => 160C => 20C/min => 200C(1min) |
Capillary | Carbowax 20M | 880. | Vinogradov, 2004 | Program: not specified |
Capillary | DB-Wax | 875. | Peng, Yang, et al., 1991 | Program: not specified |

References

von Reis, 1881
von Reis, M.A.,
Die specifische Wärme flüssiger organischer Verbindungen und ihre Beziehung zu deren Moleculargewicht,
Ann. Physik [3], 1881, 13, 447-464. [all data]
Boord, Henne, et al., 1949
Boord, C.E.; Henne, A.L.; Greenlee, K.W.; Perilstein, W.L.; Derfer, J.M.,
The Grignard Reagent in hydrocarbon synthesis,
Ind. Eng. Chem., 1949, 41, 609. [all data]
Anonymous, 1941
Anonymous, R.,
, Am. Pet. Inst. Hydrocarbon Res. Proj., Third Annu. Rep., Ohio State Univ., Aug. 31, 1941. [all data]
Henne, Chanan, et al., 1941
Henne, A.L.; Chanan, H.H.; Turk, A.,
Olefins and Diolefins from Allylic Chlorides,
J. Am. Chem. Soc., 1941, 63, 3474-6. [all data]
Nabivach and Kirilenko, 1980
Nabivach, V.M.; Kirilenko, A.V.,
Relationship between the gas chromatographic behaviour and the molecular structure of hydrocarbon samples and various stationary phases. Part II. Correlation between the retention index, physicochemical properties and molecular structure,
Chromatographia, 1980, 13, 2, 93-100, https://doi.org/10.1007/BF02263060
. [all data]
Schomburg and Dielmann, 1973
Schomburg, G.; Dielmann, G.,
Identification by means of retention parameters,
J. Chromatogr. Sci., 1973, 11, 3, 151-159, https://doi.org/10.1093/chromsci/11.3.151
. [all data]
Rembold, Wallner, et al., 1989
Rembold, H.; Wallner, P.; Nitz, S.; Kollmannsberger, H.; Drawert, F.,
Volatile components of chickpea (Cicer arietinum L.) seed,
J. Agric. Food Chem., 1989, 37, 3, 659-662, https://doi.org/10.1021/jf00087a018
. [all data]
Haagen-Smit Laboratory, 1997
Haagen-Smit Laboratory,
Procedure for the detailed hydrocarbon analysis of gasolines by single column high efficiency (capillary) column gas chromatography, SOP NO. MLD 118, Revision No. 1.1, California Environmental Protection Agency, Air Resources Board, El Monte, California, 1997, 22. [all data]
Ádámová, Orinák, et al., 2005
Ádámová, M.; Orinák, A.; Halás, L.,
Retention indices as identification tool in pyrolysis-capillary gas chromatography,
J. Chromatogr. A, 2005, 1087, 1-2, 131-141, https://doi.org/10.1016/j.chroma.2005.01.003
. [all data]
Insausti, Goñi, et al., 2005
Insausti, K.; Goñi, V.; Petri, E.; Gorraiz, C.; Beriain, M.J.,
Effect of weight at slaughter on the volatile compounds of cooked beef from Spanish cattle breeds,
Meat Sci., 2005, 70, 1, 83-90, https://doi.org/10.1016/j.meatsci.2004.12.003
. [all data]
Hierro, de la Hoz, et al., 2004
Hierro, E.; de la Hoz, L.; Ordóñez, J.A.,
Headspace volatile compounds from salted and occasionally smoked dried meats (cecinas) as affected by animal species,
Food Chem., 2004, 85, 4, 649-657, https://doi.org/10.1016/j.foodchem.2003.07.001
. [all data]
Larráyoz, Addis, et al., 2001
Larráyoz, P.; Addis, M.; Gauch, R.; Bosset, J.O.,
Comparison of dynamic headspace and simultaneous distillation extraction techniques used for the analysis of the volatile components in three European PDO ewes milk cheeses,
Int. Dairy J., 2001, 11, 11-12, 911-926, https://doi.org/10.1016/S0958-6946(01)00144-3
. [all data]
Peng, Ding, et al., 1988
Peng, C.T.; Ding, S.F.; Hua, R.L.; Yang, Z.C.,
Prediction of Retention Indexes I. Structure-Retention Index Relationship on Apolar Columns,
J. Chromatogr., 1988, 436, 137-172, https://doi.org/10.1016/S0021-9673(00)94575-8
. [all data]
Malliaa, Fernandez-Garcia, et al., 2005
Malliaa, S.; Fernandez-Garcia, E.; Bosset, J.O.,
Comparison of purge and trap and solid phase microextraction techniques for studying the volatile aroma compounds of three European PDO hard cheeses,
Int. Dairy J., 2005, 15, 6-9, 741-758, https://doi.org/10.1016/j.idairyj.2004.11.007
. [all data]
Tanchotikul and Hsieh, 1989
Tanchotikul, U.; Hsieh, T.C.-Y.,
Volatile Flavor Components in Crayfish Waste,
J. Food Sci., 1989, 54, 6, 1515-1520, https://doi.org/10.1111/j.1365-2621.1989.tb05149.x
. [all data]
Bianchi, Careri, et al., 2007
Bianchi, F.; Careri, M.; Mangia, A.; Musci, M.,
Retention indices in the analysis of food aroma volatile compounds in temperature-programmed gas chromatography: Database creation and evaluation of precision and robustness,
J. Sep. Sci., 2007, 39, 4, 563-572, https://doi.org/10.1002/jssc.200600393
. [all data]
Mildner-Szkudlarz and Jelen, 2008
Mildner-Szkudlarz, S.; Jelen, H.H.,
The potential of different techniques for volatile compounds analysis coupled with PCA for the detection of the adulteration of olive oil with hazelnut oil,
Food Chem., 2008, 110, 3, 751-761, https://doi.org/10.1016/j.foodchem.2008.02.053
. [all data]
Mildner-Szkudlarz, Jelen, et al., 2003
Mildner-Szkudlarz, S.; Jelen, H.H.; Zawirska-Wojtasiak, R.; Wasowicz, E.,
Application of headspace - solid phase microextraction and multivariate analysis for plant oils differentiation,
Food Chem., 2003, 83, 4, 515-522, https://doi.org/10.1016/S0308-8146(03)00147-X
. [all data]
Sebastian, Viallon-Fernandez, et al., 2003
Sebastian, I.; Viallon-Fernandez, C.; Berge, P.; Berdague, J.-L.,
Analysis of the volatile fraction of lamb fat tissue: influence of the type of feeding,
Sciences des Aliments, 2003, 23, 4, 497-511, https://doi.org/10.3166/sda.23.497-511
. [all data]
Vichi, Pizzale, et al., 2003
Vichi, S.; Pizzale, L.; Conte, L.S.; Buxaderas, S.; López-Tamames, E.,
Solid-phase microextraction in the analysis of virgin olive oil volatile fraction: modifications induced by oxidation and suitable markers of oxidative status,
J. Agric. Food Chem., 2003, 51, 22, 6564-6571, https://doi.org/10.1021/jf030268k
. [all data]
García, Martín, et al., 2000
García, C.; Martín, A.; Timón, M.L.; Córdoba, J.J.,
Microbial populations and volatile compounds in the 'bone taint' spoilage of dry cured ham,
Lett. Appl. Microbiol., 2000, 30, 1, 61-66, https://doi.org/10.1046/j.1472-765x.2000.00663.x
. [all data]
Ciccioli, Cecinato, et al., 1992
Ciccioli, P.; Cecinato, A.; Brancaleoni, E.; Frattoni, M.; Liberti, A.,
Use of carbon adsorption traps combined with high resolution gas chromatography - mass spectrometry for the analysis of polar and non-polar C4-C14 hydrocarbons involved in photochemical smog formation,
J. Hi. Res. Chromatogr., 1992, 15, 2, 75-84, https://doi.org/10.1002/jhrc.1240150205
. [all data]
Vinogradov, 2004
Vinogradov, B.A.,
Production, composition, properties and application of essential oils, 2004, retrieved from http://viness.narod.ru. [all data]
Poligne, Collignan, et al., 2002
Poligne, I.; Collignan, A.; Trystram, G.,
Effects of salting, drying, cooking, and smoking operations on volatile compound formation and collor patterns in pork,
Food Eng. Physical Properties, 2002, 67, 8, 2976-2986. [all data]
Ganeko, Shoda, et al., 2008
Ganeko, N.; Shoda, M.; Hirohara, I.; Bhadra, A.; Ishida, T.; Matsuda, H.; Takamura, H.; Matoba, T.,
Analysis of volatile flavor compounds of sardine (Sardinops melanostica) by solid phase microextraction,
J. Food Sci., 2008, 73, 1, s83-s88, https://doi.org/10.1111/j.1750-3841.2007.00608.x
. [all data]
Berard, Bianchi, et al., 2007
Berard, J.; Bianchi, F.; Careri, M.; Chatel, A.; Mangia, A.; Musci, M.,
Characterization of the volatile fraction and of free fatty acids of Fontina Valle d'Aosta, a protected designation of origin Italian cheese,
Food Chem., 2007, 105, 1, 293-300, https://doi.org/10.1016/j.foodchem.2006.11.041
. [all data]
Peng, Yang, et al., 1991
Peng, C.T.; Yang, Z.C.; Ding, S.F.,
Prediction of rentention idexes. II. Structure-retention index relationship on polar columns,
J. Chromatogr., 1991, 586, 1, 85-112, https://doi.org/10.1016/0021-9673(91)80028-F
. [all data]