Octanoyl chloride
- Formula: C8H15ClO
- Molecular weight: 162.657
- IUPAC Standard InChIKey: REEZZSHJLXOIHL-UHFFFAOYSA-N
- CAS Registry Number: 111-64-8
- Chemical structure:
View 3d structure (requires JavaScript / HTML 5) - Other names: n-Octanoyl chloride; Caprylic acid chloride; Capryloyl chloride; Caprylyl chloride

Phase change data

Data compiled as indicated in comments:
BS - Robert L. Brown and Stephen E. Stein
TRC - Thermodynamics Research Center, NIST Boulder Laboratories, Chris Muzny director
AC - William E. Acree, Jr., James S. Chickos
Quantity | Value | Units | Method | Reference | Comment |
---|---|---|---|---|---|
Tboil | 468.8 | K | N/A | Weast and Grasselli, 1989 | BS |
Quantity | Value | Units | Method | Reference | Comment |
Tfus | 210.4 | K | N/A | Paquette, Lingafelter, et al., 1943 | Uncertainty assigned by TRC = 1. K; TRC |
Enthalpy of vaporization
ΔvapH (kJ/mol) | Temperature (K) | Method | Reference | Comment |
---|---|---|---|---|
74.5 | 358. | A | Stephenson and Malanowski, 1987 | Based on data from 343. to 373. K. See also Dykyj, Svoboda, et al., 1999.; AC |

Van Den Dool and Kratz RI, non-polar column, custom temperature program

Column type | Active phase | I | Reference | Comment |
---|---|---|---|---|
Capillary | VF-5MS | 1113.7 | Tret'yakov, 2007 | 30. m/0.25 mm/0.25 μm, He; Program: Multi-step temperature program; T(initial)=60C; T(final)=270C |

References

Weast and Grasselli, 1989
CRC Handbook of Data on Organic Compounds, 2nd Editon, Weast,R.C and Grasselli, J.G., ed(s)., CRC Press, Inc., Boca Raton, FL, 1989, 1. [all data]
Paquette, Lingafelter, et al., 1943
Paquette, R.G.; Lingafelter, E.C.; Tartar, H.V.,
Studies of Sulfonates VII. COnductances and Densities of Sodium Ethyl-, n-Butyl, n-Octyl, and n-Dodecylbenzene-p-sulfonate Solutions,
J. Am. Chem. Soc., 1943, 65, 687. [all data]
Stephenson and Malanowski, 1987
Stephenson, Richard M.; Malanowski, Stanislaw,
Handbook of the Thermodynamics of Organic Compounds, 1987, https://doi.org/10.1007/978-94-009-3173-2
. [all data]
Dykyj, Svoboda, et al., 1999
Dykyj, J.; Svoboda, J.; Wilhoit, R.C.; Frenkel, M.L.; Hall, K.R.,
Vapor Pressure of Chemicals: Part A. Vapor Pressure and Antoine Constants for Hydrocarbons and Sulfur, Selenium, Tellurium and Hydrogen Containing Organic Compounds, Springer, Berlin, 1999, 373. [all data]
Tret'yakov, 2007
Tret'yakov, K.V.,
Retention Data. NIST Mass Spectrometry Data Center., NIST Mass Spectrometry Data Center, 2007. [all data]