Ethyl Oleate
- Formula: C20H38O2
- Molecular weight: 310.5145
- IUPAC Standard InChIKey: LVGKNOAMLMIIKO-QXMHVHEDSA-N
- CAS Registry Number: 111-62-6
- Chemical structure:
View 3d structure (requires JavaScript / HTML 5) - Stereoisomers:
- Other names: 9-Octadecenoic acid (Z)-, ethyl ester; Oleic acid, ethyl ester; (Z)-9-Octadecenoic acid ethyl ester; Ethyl cis-9-octadecenoate; Ethyl Z-9-octadecenoate; Ethyl (9Z)-9-octadecenoate; Ethyl oleate 1

Condensed phase thermochemistry data

Data compiled by: Hussein Y. Afeefy, Joel F. Liebman, and Stephen E. Stein
Quantity | Value | Units | Method | Reference | Comment |
---|---|---|---|---|---|
ΔcH°liquid | -2993.6 ± 2.9 | kcal/mol | Ccb | Keffler, 1937 | Reanalyzed by Cox and Pilcher, 1970, Original value = -2988.2 kcal/mol; See Keffler and McLean, 1935; Corresponding ΔfHºliquid = -185.41 kcal/mol (simple calculation by NIST; no Washburn corrections) |
ΔcH°liquid | -2983.15 | kcal/mol | Ccb | Keffler and McLean, 1935 | Corresponding ΔfHºliquid = -195.9 kcal/mol (simple calculation by NIST; no Washburn corrections) |

Phase change data

Data compiled as indicated in comments:
BS - Robert L. Brown and Stephen E. Stein
TRC - Thermodynamics Research Center, NIST Boulder Laboratories, Chris Muzny director
AC - William E. Acree, Jr., James S. Chickos
Quantity | Value | Units | Method | Reference | Comment |
---|---|---|---|---|---|
Tboil | 479.7 | K | N/A | Aldrich Chemical Company Inc., 1990 | BS |
Quantity | Value | Units | Method | Reference | Comment |
Tfus | 293.15 | K | N/A | Boeseken and Belinfante, 1926 | Uncertainty assigned by TRC = 4. K; TRC |
Enthalpy of vaporization
ΔvapH (kcal/mol) | Temperature (K) | Method | Reference | Comment |
---|---|---|---|---|
22.1 | 399. | A | Stephenson and Malanowski, 1987 | Based on data from 384. to 481. K.; AC |

Kovats' RI, non-polar column, temperature ramp

Column type | Active phase | I | Reference | Comment |
---|---|---|---|---|
Capillary | OV-101 | 2142. | Shibamoto, Kamiya, et al., 1981 | N2, 1. K/min; Column length: 80. m; Column diameter: 0.28 mm; Tstart: 80. C; Tend: 200. C |
Capillary | OV-101 | 2149. | Shibamoto, Kamiya, et al., 1981 | N2, 1. K/min; Column length: 80. m; Column diameter: 0.28 mm; Tstart: 80. C; Tend: 200. C |

Kovats' RI, non-polar column, custom temperature program

Column type | Active phase | I | Reference | Comment |
---|---|---|---|---|
Packed | SE-30 | 2175. | Ramsey, Lee, et al., 1980 | He, Chromosorb G HP (80-100 mesh); Column length: 1.5 m; Program: not specified |

Kovats' RI, polar column, temperature ramp

Column type | Active phase | I | Reference | Comment |
---|---|---|---|---|
Capillary | Carbowax 20M | 2446. | Shibamoto, Kamiya, et al., 1981 | N2, 2. K/min; Column length: 50. m; Column diameter: 0.28 mm; Tstart: 80. C; Tend: 200. C |
Capillary | Carbowax 20M | 2455. | Shibamoto, Kamiya, et al., 1981 | N2, 2. K/min; Column length: 50. m; Column diameter: 0.28 mm; Tstart: 80. C; Tend: 200. C |

Kovats' RI, polar column, custom temperature program

Column type | Active phase | I | Reference | Comment |
---|---|---|---|---|
Capillary | DB-Wax | 2470. | Rezende and Fraga, 2003 | 30. m/0.25 mm/0.25 μm, He; Program: 40C(5min) => 5C/min => 150C => 8C/min => 240C(25min) |

Van Den Dool and Kratz RI, non-polar column, temperature ramp

Column type | Active phase | I | Reference | Comment |
---|---|---|---|---|
Capillary | HP-5 | 2179. | Quijano, Salamanca, et al., 2007 | 30. m/0.25 mm/0.25 μm, He, 50. C @ 4. min, 4. K/min, 250. C @ 10. min |
Capillary | HP-5MS | 2179. | Pino, Mesa, et al., 2005 | 30. m/0.25 mm/0.25 μm, He, 60. C @ 2. min, 4. K/min, 250. C @ 20. min |
Capillary | HP-5MS | 2171. | Lalel, Singh, et al., 2003 | 60. m/0.25 mm/0.25 μm, He, 40. C @ 1. min, 3. K/min, 310. C @ 20. min |
Capillary | CP Sil 5 CB | 2171. | Pino, Almora, et al., 2003 | 60. m/0.32 mm/0.25 μm, He, 60. C @ 10. min, 3. K/min, 280. C @ 60. min |
Capillary | OV-1 | 2160. | Tan, Holland, et al., 1988 | He, 8. K/min, 280. C @ 10. min; Column length: 25. m; Column diameter: 0.32 mm; Tstart: 40. C |

Van Den Dool and Kratz RI, non-polar column, custom temperature program

Column type | Active phase | I | Reference | Comment |
---|---|---|---|---|
Capillary | HP-5MS | 2168.8 | Andriamaharavo, 2014 | 30. m/0.25 mm/0.25 μm, He; Program: 60C (1 min) => 5 C/min => 210C => 10 C/min => 280C (15 min) |

Van Den Dool and Kratz RI, polar column, temperature ramp

Column type | Active phase | I | Reference | Comment |
---|---|---|---|---|
Capillary | OV-351 | 2445. | Bonvehí, 2005 | 50. m/0.32 mm/0.2 μm, He, 5. K/min; Tstart: 60. C; Tend: 220. C |
Capillary | Supelcowax-10 | 2461. | Chung, Fung, et al., 2005 | 60. m/0.25 mm/0.25 μm, 35. C @ 5. min, 6. K/min, 195. C @ 60. min |
Capillary | ZB-Wax | 2484. | Ledauphin, Saint-Clair, et al., 2004 | 30. m/0.25 mm/0.15 μm, He, 35. C @ 10. min, 1.8 K/min, 220. C @ 10. min |
Capillary | AT-Wax | 2468. | Pino, Almora, et al., 2003 | 60. m/0.32 mm/0.25 μm, He, 65. C @ 10. min, 2. K/min, 250. C @ 60. min |
Capillary | Supelcowax-10 | 2480. | Chung, 2000 | 60. m/0.25 mm/0.25 μm, He, 2. K/min, 195. C @ 90. min; Tstart: 35. C |
Capillary | Supelcowax-10 | 2480. | Chung, 1999 | 60. m/0.25 mm/0.25 μm, He, 35. C @ 5. min, 2. K/min, 195. C @ 90. min |

Normal alkane RI, non-polar column, temperature ramp

Column type | Active phase | I | Reference | Comment |
---|---|---|---|---|
Capillary | DP-5 | 2185. | Vijayakumar, Duraipandiyan, et al., 2012 | 30. m/0.25 mm/0.25 μm, Helium, 80. C @ 1. min, 4. K/min, 300. C @ 40. min |
Capillary | HP-5MS | 2180. | Tesevic, Nikicevic, et al., 2005 | 30. m/0.25 mm/0.25 μm, He, 4.3 K/min; Tstart: 60. C; Tend: 285. C |
Capillary | DB-5 | 2180. | Palmeira, Conserva, et al., 2001 | 30. m/0.25 mm/0.25 μm, He, 3. K/min; Tstart: 60. C; Tend: 270. C |
Capillary | SE-30 | 2150. | Alves and Jennings, 1979 | Helium, 2. K/min; Tstart: 70. C; Tend: 170. C |

Normal alkane RI, non-polar column, custom temperature program

Column type | Active phase | I | Reference | Comment |
---|---|---|---|---|
Capillary | HP-5 | 2173. | Custer, 2009 | 25. m/0.32 mm/0.17 μm, Helium; Program: 60 0C (5 min) 4 0C/min -> 220 0C 11 0C/min -> 280 0C (15 min) |
Capillary | HP-5 | 2171. | Custer, 2009 | 25. m/0.32 mm/0.17 μm, Helium; Program: not specified |
Capillary | HP-5 | 2172. | Povolo, Pelizzola, et al., 2009 | 30. m/0.32 mm/0.25 μm, Helium; Program: 60 0C (3 min) 10 0C/min -> 280 0C (1 min) 3 0C/min -> 320 0C (20 min) |
Capillary | SE-30 | 2155. | Vinogradov, 2004 | Program: not specified |
Capillary | HP-5 | 2168. | Demyttenaere, Sánchez Martínez, et al., 2003 | 30. m/0.25 mm/0.25 μm, He; Program: 35C => 5C/min => 220C => 10C/min => 240C(5min) |
Capillary | HP-5MS | 2173. | Demyttenaere, Sánchez Martínez, et al., 2002 | 30. m/0.25 mm/0.25 μm, He; Program: 35C => 5C/min => 160C => 10C/min => 220C (10min) |
Capillary | OV-1, SE-30, Methyl silicone, SP-2100, OV-101, DB-1, etc. | 2149. | Waggott and Davies, 1984 | Hydrogen; Column length: 50. m; Column diameter: 0.32 mm; Program: not specified |
Capillary | OV-1, SE-30, Methyl silicone, SP-2100, OV-101, DB-1, etc. | 2175. | Waggott and Davies, 1984 | Hydrogen; Column length: 50. m; Column diameter: 0.32 mm; Program: not specified |
Other | Methyl Silicone | 2175. | Ardrey and Moffat, 1981 | Program: not specified |

Normal alkane RI, polar column, temperature ramp

Column type | Active phase | I | Reference | Comment |
---|---|---|---|---|
Capillary | TC-Wax | 2472. | Miyazawa and Okuno, 2003 | He, 4. K/min, 250. C @ 30. min; Column length: 60. m; Column diameter: 0.25 mm; Tstart: 80. C |
Capillary | EC-1000 | 2470. | Bendall, 2001 | 30. m/0.25 mm/0.25 μm, He, 35. C @ 5. min, 5. K/min, 230. C @ 15. min |
Capillary | DB-Wax | 2476. | Umano, Hagi, et al., 2000 | 60. m/0.25 mm/0.25 μm, He, 40. C @ 2. min, 2. K/min; Tend: 200. C |
Capillary | TC-Wax | 2487. | Shuichi, Masazumi, et al., 1996 | 80. C @ 5. min, 3. K/min; Column length: 60. m; Column diameter: 0.25 mm; Tend: 240. C |

Normal alkane RI, polar column, custom temperature program

Column type | Active phase | I | Reference | Comment |
---|---|---|---|---|
Capillary | Carbowax 20M | 2489. | Vinogradov, 2004 | Program: not specified |
Capillary | HP-Innowax FSC | 2493. | Erdemoglu, Sener, et al., 2003 | 60. m/0.25 mm/0.25 μm, He; Program: 60C(10min) => 4C/min => 220C(10min) => 1C/min => 240C |
Capillary | Nukol | 2442. | López and Dufour, 2001 | N2; Column length: 25. m; Column diameter: 0.25 mm; Program: 45C(5min) => 20C/min => 100C(1min) => 3C/min => 190C(40min) |

References

Keffler, 1937
Keffler, L.J.P.,
Homology and isomerism in long-chain compounds. I. A thermochemical study of the n-alkyl esters derived from the monoethylenic monocarboxylic acids in C18,
J. Phys. Chem., 1937, 41, 715-721. [all data]
Cox and Pilcher, 1970
Cox, J.D.; Pilcher, G.,
Thermochemistry of Organic and Organometallic Compounds, Academic Press, New York, 1970, 1-636. [all data]
Keffler and McLean, 1935
Keffler, L.; McLean, J.H.,
Homology in long-chain compounds, I. Oleic acid and the n-alkul oleates,
J. Soc. Chem. Ind., 1935, 178-185. [all data]
Aldrich Chemical Company Inc., 1990
Aldrich Chemical Company Inc.,
Catalog Handbook of Fine Chemicals, Aldrich Chemical Company, Inc., Milwaukee WI, 1990, 1. [all data]
Boeseken and Belinfante, 1926
Boeseken, J.; Belinfante, A.H.,
The Configuration of Oleic and Elaidic Acids,
Recl. Trav. Chim. Pays-Bas, 1926, 45, 914. [all data]
Stephenson and Malanowski, 1987
Stephenson, Richard M.; Malanowski, Stanislaw,
Handbook of the Thermodynamics of Organic Compounds, 1987, https://doi.org/10.1007/978-94-009-3173-2
. [all data]
Shibamoto, Kamiya, et al., 1981
Shibamoto, T.; Kamiya, Y.; Mihara, S.,
Isolation and identification of volatile compounds in cooked meat: sukiyaki,
J. Agric. Food Chem., 1981, 29, 1, 57-63, https://doi.org/10.1021/jf00103a015
. [all data]
Ramsey, Lee, et al., 1980
Ramsey, J.D.; Lee, T.D.; Osselton, M.D.; Moffat, A.C.,
Gas-liquid chromatographic retention indices of 296 non-drug substances on SE-30 or OV-1 likely to be encountered in toxicological analyses,
J. Chromatogr., 1980, 184, 2, 185-206, https://doi.org/10.1016/S0021-9673(00)85641-1
. [all data]
Rezende and Fraga, 2003
Rezende, C.M.; Fraga, S.R.G.,
Chemical and aroma determination of the pulp and seeds of murici (Byrsonima crassifolia L.),
J. Braz. Chem. Soc., 2003, 14, 3, 425-428, https://doi.org/10.1590/S0103-50532003000300014
. [all data]
Quijano, Salamanca, et al., 2007
Quijano, C.E.; Salamanca, G.; Pino, J.A.,
Aroma volatile constituents of Colombian varieties of mango (Mangifera indica L.),
Flavour Fragr. J., 2007, 22, 5, 401-406, https://doi.org/10.1002/ffj.1812
. [all data]
Pino, Mesa, et al., 2005
Pino, J.A.; Mesa, J.; Muñoz, Y.; Martí, M.P.; Marbot, R.,
Volatile components from mango (Mangifera indica L.) cultivars,
J. Agric. Food Chem., 2005, 53, 6, 2213-2223, https://doi.org/10.1021/jf0402633
. [all data]
Lalel, Singh, et al., 2003
Lalel, H.J.D.; Singh, Z.; Chye Tan, S.,
Glycosidically-bound aroma volatile compounds in the skin and pulp of 'Kensington Pride' mango fruit at different stages of maturity,
Postharvest Biol. Technol., 2003, 29, 2, 205-218, https://doi.org/10.1016/S0925-5214(02)00250-8
. [all data]
Pino, Almora, et al., 2003
Pino, J.; Almora, K.; Marbot, R.,
Volatile components of papaya (Carica papaya L., maradol variety) fruit,
Flavour Fragr. J., 2003, 18, 6, 492-496, https://doi.org/10.1002/ffj.1248
. [all data]
Tan, Holland, et al., 1988
Tan, S.-T.; Holland, P.T.; Wilkins, A.L.; Molan, P.C.,
Extractives from New Zealand honeys. 1. White clovers, manuka, and kanuka unifloral honeys,
J. Agric. Food Chem., 1988, 36, 3, 453-460, https://doi.org/10.1021/jf00081a012
. [all data]
Andriamaharavo, 2014
Andriamaharavo, N.R.,
Retention Data. NIST Mass Spectrometry Data Center., NIST Mass Spectrometry Data Center, 2014. [all data]
Bonvehí, 2005
Bonvehí, J.S.,
Investigation of aromatic compounds in roasted cocoa powder,
Eur. Food Res. Technol., 2005, 221, 1-2, 19-29, https://doi.org/10.1007/s00217-005-1147-y
. [all data]
Chung, Fung, et al., 2005
Chung, H.Y.; Fung, P.K.; Kim, J.-S.,
Aroma impact components in commercial plain sufu,
J. Agric. Food Chem., 2005, 53, 5, 1684-1691, https://doi.org/10.1021/jf048617d
. [all data]
Ledauphin, Saint-Clair, et al., 2004
Ledauphin, J.; Saint-Clair, J.-F.; Lablanquie, O.; Guichard, H.; Founier, N.; Guichard, E.; Barillier, D.,
Identification of trace volatile compounds in freshly distilled calvados and cognac using preparative separations coupled with gas chromatography-mass spectrometry,
J. Agric. Food Chem., 2004, 52, 16, 5124-5134, https://doi.org/10.1021/jf040052y
. [all data]
Chung, 2000
Chung, H.Y.,
Volatile flavor components in red fermented soybean (Glycine max) curds,
J. Agric. Food Chem., 2000, 48, 5, 1803-1809, https://doi.org/10.1021/jf991272s
. [all data]
Chung, 1999
Chung, H.Y.,
Volatile components in fermented soybean (Glycine max) curds,
J. Agric. Food Chem., 1999, 47, 7, 2690-2696, https://doi.org/10.1021/jf981166a
. [all data]
Vijayakumar, Duraipandiyan, et al., 2012
Vijayakumar, A.; Duraipandiyan, V.; Jeyarai, B.; Agastian, P.; Raj, M.K.; Ignacimunthu, S.,
Phytochemical analysis and in vitro antimicrobial activity of Illicium griffithii Hook f. Thoms extracts,
Asian Pacific J. Tropical Diseases, 2012, 2, 3, 190-199, https://doi.org/10.1016/S2222-1808(12)60045-0
. [all data]
Tesevic, Nikicevic, et al., 2005
Tesevic, V.; Nikicevic, N.; Jovanovic, A.; Djokovic, D.; Vujisic, L.; Vuckovic, I.; Bonic, M.,
Volatile components from old plum brandies,
Food Technol. Biotechnol., 2005, 43, 4, 367-372. [all data]
Palmeira, Conserva, et al., 2001
Palmeira, S.F., Jr.; Conserva, L.M.; Andrade, E.H.A.; Guilhon, G.M.S.P.,
Analysis by GC-MS of the hexane extract of the aerial parts of Aristolochia acutifolia Duchtr.,
Flavour Fragr. J., 2001, 16, 2, 85-88, https://doi.org/10.1002/1099-1026(200103/04)16:2<85::AID-FFJ948>3.0.CO;2-2
. [all data]
Alves and Jennings, 1979
Alves, S.; Jennings, W.G.,
Volatile composition of certain Amazonian fruits,
Food Chem., 1979, 4, 2, 149-159, https://doi.org/10.1016/0308-8146(79)90039-6
. [all data]
Custer, 2009
Custer, Y.,
GC Volatile Components Analysis of Different Parts of Litchi chinensis (Dissertation), 2009. [all data]
Povolo, Pelizzola, et al., 2009
Povolo, M.; Pelizzola, V.; Ravera, D.; Contarini, G.,
Significance of the nonvolatile minor compounds of the neutral lipid fraction as markers of the origin of dairy products,
J. Agric. Food Chem., 2009, 57, 16, 7387-7394, https://doi.org/10.1021/jf8040353
. [all data]
Vinogradov, 2004
Vinogradov, B.A.,
Production, composition, properties and application of essential oils, 2004, retrieved from http://viness.narod.ru. [all data]
Demyttenaere, Sánchez Martínez, et al., 2003
Demyttenaere, J.C.R.; Sánchez Martínez, J.I.; Verhé, R.; Sandra, P.; de Kimpe, N.,
Analysis of volatiles of malt whisky by solid-phase microextraction and stir bar sorptive extraction,
J. Chromatogr. A, 2003, 985, 1-2, 221-232, https://doi.org/10.1016/S0021-9673(02)01471-1
. [all data]
Demyttenaere, Sánchez Martínez, et al., 2002
Demyttenaere, J.C.R.; Sánchez Martínez, J.I.; Téllez Valdés, M.J.; Verhé, R.; Sandra, P.,
Analysis of volatile esters of malt whisky using solid phase microextraction and dynamic headspace
in 25th International Symposium on Capillary Chromatography, 2002, 1-13. [all data]
Waggott and Davies, 1984
Waggott, A.; Davies, I.W.,
Identification of organic pollutants using linear temperature programmed retention indices (LTPRIs) - Part II, 1984, retrieved from http://dwi.defra.gov.uk/research/completed-research/reports/dwi0383.pdf. [all data]
Ardrey and Moffat, 1981
Ardrey, R.E.; Moffat, A.C.,
Gas-liquid chromatographic retention indices of 1318 substances of toxicological interest on SE-30 or OV-1 stationary phase,
J. Chromatogr., 1981, 220, 3, 195-252, https://doi.org/10.1016/S0021-9673(00)81925-1
. [all data]
Miyazawa and Okuno, 2003
Miyazawa, M.; Okuno, Y.,
Volatile components from the roots of Scrophularia ningpoensis Hemsl.,
Flavour Fragr. J., 2003, 18, 5, 398-400, https://doi.org/10.1002/ffj.1232
. [all data]
Bendall, 2001
Bendall, J.G.,
Aroma compounds of fresh milk from New Zealand cows fed different diets,
J. Agric. Food Chem., 2001, 49, 10, 4825-4832, https://doi.org/10.1021/jf010334n
. [all data]
Umano, Hagi, et al., 2000
Umano, K.; Hagi, Y.; Nakahara, K.; Shoji, A.; Shibamoto, T.,
Volatile chemicals identified in extracts from leaves of Japanese mugwort (Artemisia princeps Pamp.),
J. Agric. Food Chem., 2000, 48, 8, 3463-3469, https://doi.org/10.1021/jf0001738
. [all data]
Shuichi, Masazumi, et al., 1996
Shuichi, H.; Masazumi, N.; Hiromu, K.; Kiyoshi, F.,
Comparison of volatile compounds berween the crude drugs, Onji-tsutsu and Onji-niki,
Nippon nogei kagaku kaishi, 1996, 70, 2, 151-160. [all data]
Erdemoglu, Sener, et al., 2003
Erdemoglu, N.; Sener, B.; Demirci, B.; Baser, K.H.C.,
The glycosidically bound volatile compounds of Taxus baccata,
Chem. Nat. Compd. (Engl. Transl.), 2003, 39, 2, 195-198, https://doi.org/10.1023/A:1024870031960
. [all data]
López and Dufour, 2001
López, M.G.; Dufour, J.P.,
Chapter 6. Tequilas: charm analysis of Blanco, Teposado, and Anejo tequilas,
Am. Chem. Soc. Symp. Ser., 2001, 782, 62-72. [all data]