Butanedioic acid, acetyl-, diethyl ester
- Formula: C10H16O5
- Molecular weight: 216.2310
- IUPAC Standard InChIKey: DVSDDICSXBCMQJ-UHFFFAOYSA-N
- CAS Registry Number: 1115-30-6
- Chemical structure:
View 3d structure (requires JavaScript / HTML 5) - Other names: Diethyl acetylsuccinate; Acetylsuccinic acid diethyl ester; Diethyl acetosuccinate; Diethyl 2-acetylsuccinate; Ethyl acetylsuccinate; Succinic acid, acetyl-, diethyl ester

Phase change data

Data compiled by: Robert L. Brown and Stephen E. Stein
Quantity | Value | Units | Method | Reference | Comment |
---|---|---|---|---|---|
Tboil | 528.2 | K | N/A | Weast and Grasselli, 1989 | |
Tboil | 527. to 529. | K | N/A | Buckingham and Donaghy, 1982 |
Reduced pressure boiling point
Tboil (K) | Pressure (bar) | Reference |
---|---|---|
454.7 | 0.067 | Aldrich Chemical Company Inc., 1990 |
413. to 415. | 0.020 | Buckingham and Donaghy, 1982 |

References

Weast and Grasselli, 1989
CRC Handbook of Data on Organic Compounds, 2nd Editon, Weast,R.C and Grasselli, J.G., ed(s)., CRC Press, Inc., Boca Raton, FL, 1989, 1. [all data]
Buckingham and Donaghy, 1982
Buckingham, J.; Donaghy, S.M.,
Dictionary of Organic Compounds: Fifth Edition, Chapman and Hall, New York, 1982, 1. [all data]
Aldrich Chemical Company Inc., 1990
Aldrich Chemical Company Inc.,
Catalog Handbook of Fine Chemicals, Aldrich Chemical Company, Inc., Milwaukee WI, 1990, 1. [all data]