1-(Dimethoxy-phenylmethyl)-1H-imidazole
- Formula: C12H14N2O2
- Molecular weight: 218.2518
- IUPAC Standard InChIKey: KDFJJNPLCGDESX-UHFFFAOYSA-N
- CAS Registry Number: 111456-85-0
- Chemical structure:
View 3d structure (requires JavaScript / HTML 5) - Permanent link for this species. Use this link for bookmarking this species for future reference.

Gas phase thermochemistry data

Data compiled by: Hussein Y. Afeefy, Joel F. Liebman, and Stephen E. Stein
Quantity | Value | Units | Method | Reference | Comment |
---|---|---|---|---|---|
ΔfH°gas | -77.5 ± 3.7 | kJ/mol | Cm | Guthrie and Pike, 1987 | Heat of hydrolysis |

Condensed phase thermochemistry data

Data compiled by: Hussein Y. Afeefy, Joel F. Liebman, and Stephen E. Stein
Quantity | Value | Units | Method | Reference | Comment |
---|---|---|---|---|---|
ΔfH°liquid | -163.1 ± 3.6 | kJ/mol | Cm | Guthrie and Pike, 1987 | Heat of hydrolysis |

Phase change data

Data compiled by: Hussein Y. Afeefy, Joel F. Liebman, and Stephen E. Stein
Quantity | Value | Units | Method | Reference | Comment |
---|---|---|---|---|---|
ΔvapH° | 85.6 ± 1.2 | kJ/mol | E | Guthrie and Pike, 1987 | Heat of hydrolysis |

Reaction thermochemistry data

Data compiled by: Hussein Y. Afeefy, Joel F. Liebman, and Stephen E. Stein
Individual Reactions
By formula: C12H14N2O2 + H2O = C3H4N2 + CH4O + C8H8O2
Quantity | Value | Units | Method | Reference | Comment |
---|---|---|---|---|---|
ΔrH° | -55.48 ± 0.71 | kJ/mol | Cm | Guthrie and Pike, 1987 | liquid phase; Heat of hydrolysis |

References

Guthrie and Pike, 1987
Guthrie, J.P.; Pike, D.C.,
Hydration of acylimidazoles: tetrahedral intermediates in acylimidazole hydrolysis and nucleophilic attack by imidazole on esters. The question of concerted mechanisms for acyl transfers,
Can. J. Chem., 1987, 65, 1951-1969. [all data]