Diethanolamine
- Formula: C4H11NO2
- Molecular weight: 105.1356
- IUPAC Standard InChIKey: ZBCBWPMODOFKDW-UHFFFAOYSA-N
- CAS Registry Number: 111-42-2
- Chemical structure:
View 3d structure (requires JavaScript / HTML 5) - Other names: Ethanol, 2,2'-iminobis-; Ethanol, 2,2'-iminodi-; Bis(2-hydroxyethyl)amine; Di(2-hydroxyethyl)amine; Diolamine; Iminodiethanol; N,N-Diethanolamine; 2-[(2-Hydroxyethyl)amino]ethanol; 2,2'-Dihydroxydiethylamine; 2,2'-Iminobis[ethanol]; 2,2'-Iminodi-1-ethanol; 2,2'-Iminodiethanol; Diaethanolamin; Diethanolamin; Diethylamine, 2,2'-dihydroxy-; Diethylolamine; DEA; NCI-C55174; N,N-Bis(2-hydroxyethyl)amine; Bis(hydroxyethyl)amine; Dabco DEOA-LF; Diethanol, 2,2'-imino-; N,N'-Iminodiethanol; Niax DEOA-LF; NSC 4959

Gas phase thermochemistry data

Data compiled by: Hussein Y. Afeefy, Joel F. Liebman, and Stephen E. Stein
Quantity | Value | Units | Method | Reference | Comment |
---|---|---|---|---|---|
ΔfH°gas | -397.1 ± 2.9 | kJ/mol | Ccr | Minadakis and Sabbah, 1982 |

Condensed phase thermochemistry data

Data compiled as indicated in comments:
ALS - Hussein Y. Afeefy, Joel F. Liebman, and Stephen E. Stein
DH - Eugene S. Domalski and Elizabeth D. Hearing
Quantity | Value | Units | Method | Reference | Comment |
---|---|---|---|---|---|
ΔfH°solid | -493.8 ± 2.6 | kJ/mol | Ccr | Minadakis and Sabbah, 1982 | ALS |
Quantity | Value | Units | Method | Reference | Comment |
ΔcH°solid | -2652.3 ± 2.5 | kJ/mol | Ccr | Minadakis and Sabbah, 1982 | ALS |
Constant pressure heat capacity of solid
Cp,solid (J/mol*K) | Temperature (K) | Reference | Comment |
---|---|---|---|
137. | 298.15 | Minadakis and Sabbah, 1982 | Cp given as 1.3 J/g*K, an estimated value.; DH |

Phase change data

Data compiled as indicated in comments:
BS - Robert L. Brown and Stephen E. Stein
TRC - Thermodynamics Research Center, NIST Boulder Laboratories, Chris Muzny director
AC - William E. Acree, Jr., James S. Chickos
ALS - Hussein Y. Afeefy, Joel F. Liebman, and Stephen E. Stein
Quantity | Value | Units | Method | Reference | Comment |
---|---|---|---|---|---|
Tboil | 544.2 | K | N/A | Weast and Grasselli, 1989 | BS |
Quantity | Value | Units | Method | Reference | Comment |
Tfus | 301.1 | K | N/A | McDonald, Shrader, et al., 1959 | Uncertainty assigned by TRC = 0.07 K; TRC |
Quantity | Value | Units | Method | Reference | Comment |
ΔsubH° | 96.7 ± 1.2 | kJ/mol | C | Minadakis and Sabbah, 1982 | ALS |
ΔsubH° | 105.9 ± 2.0 | kJ/mol | C | Minadakis and Sabbah, 1982 | AC |
Reduced pressure boiling point
Tboil (K) | Pressure (bar) | Reference | Comment |
---|---|---|---|
490.2 | 0.200 | Aldrich Chemical Company Inc., 1990 | BS |
427.7 | 0.013 | Weast and Grasselli, 1989 | BS |
Enthalpy of vaporization
ΔvapH (kJ/mol) | Temperature (K) | Method | Reference | Comment |
---|---|---|---|---|
74.4 | 438. | A | Stephenson and Malanowski, 1987 | Based on data from 423. to 542. K.; AC |
77.0 | 391. | N/A | Danov, Matin, et al., 1969 | Based on data from 376. to 454. K. See also Boublik, Fried, et al., 1984.; AC |
69. | 478. | N/A | McDonald, Shrader, et al., 1959, 2 | Based on data from 463. to 582. K.; AC |
70.6 | 481. | N/A | McDonald, Shrader, et al., 1959, 2 | Based on data from 466. to 514. K. See also Boublik, Fried, et al., 1984.; AC |
Antoine Equation Parameters
log10(P) = A − (B / (T + C))
P = vapor pressure (bar)
T = temperature (K)
View plot Requires a JavaScript / HTML 5 canvas capable browser.
Temperature (K) | A | B | C | Reference | Comment |
---|---|---|---|---|---|
464.0 to 582.4 | 5.26458 | 2328.56 | -98.751 | McDonald, Shrader, et al., 1959, 2 | |
466.93 to 514.47 | 5.19445 | 2273.949 | -103.362 | McDonald, Shrader, et al., 1959, 2 | Coefficents calculated by NIST from author's data. |

Reaction thermochemistry data

Data compiled by: Michael M. Meot-Ner (Mautner) and Sharon G. Lias
Individual Reactions
By formula: C4H12NO2+ + C4H11NO2 = (C4H12NO2+ • C4H11NO2)
Bond type: Hydrogen bonds of the type OH-O between organics
Free energy of reaction
ΔrG° (kJ/mol) | T (K) | Method | Reference | Comment |
---|---|---|---|---|
34. | 500. | PHPMS | Sunner, Kulatunga, et al., 1986 | gas phase |

Gas phase ion energetics data

Data evaluated by: Edward P. Hunter and Sharon G. Lias
Quantity | Value | Units | Method | Reference | Comment |
---|---|---|---|---|---|
Proton affinity (review) | 953. | kJ/mol | N/A | Hunter and Lias, 1998 | |
Quantity | Value | Units | Method | Reference | Comment |
Gas basicity | 920. | kJ/mol | N/A | Hunter and Lias, 1998 |

Ion clustering data

Data compiled by: Michael M. Meot-Ner (Mautner) and Sharon G. Lias
Clustering reactions
By formula: C4H12NO2+ + C4H11NO2 = (C4H12NO2+ • C4H11NO2)
Bond type: Hydrogen bonds of the type OH-O between organics
Free energy of reaction
ΔrG° (kJ/mol) | T (K) | Method | Reference | Comment |
---|---|---|---|---|
34. | 500. | PHPMS | Sunner, Kulatunga, et al., 1986 | gas phase |

Kovats' RI, polar column, isothermal

Column type | Active phase | Temperature (C) | I | Reference | Comment |
---|---|---|---|---|---|
Packed | PEG-2000 | 179. | 2200. | Anderson, Jurel, et al., 1973 | He, Celite 545 (44-60 mesh); Column length: 3. m |
Packed | PEG-2000 | 200. | 2141. | Anderson, Jurel, et al., 1973 | He, Celite 545 (44-60 mesh); Column length: 3. m |
Packed | PEG-2000 | 200. | 2180. | Anderson, Jurel, et al., 1973 | He, Celite 545 (44-60 mesh); Column length: 3. m |

References

Minadakis and Sabbah, 1982
Minadakis, C.; Sabbah, R.,
Thermodynamique de composes azotes. VIII. Etude thermochimique de la diethanolamine et de la triethyanolamine et de la reaction de reduction de l'eau par celle-ci,
Thermochim. Acta, 1982, 55, 147-159. [all data]
Weast and Grasselli, 1989
CRC Handbook of Data on Organic Compounds, 2nd Editon, Weast,R.C and Grasselli, J.G., ed(s)., CRC Press, Inc., Boca Raton, FL, 1989, 1. [all data]
McDonald, Shrader, et al., 1959
McDonald, R.A.; Shrader, S.A.; Stull, D.R.,
Vapor Pressures and Freezing Points of 30 Organics,
J. Chem. Eng. Data, 1959, 4, 311. [all data]
Aldrich Chemical Company Inc., 1990
Aldrich Chemical Company Inc.,
Catalog Handbook of Fine Chemicals, Aldrich Chemical Company, Inc., Milwaukee WI, 1990, 1. [all data]
Stephenson and Malanowski, 1987
Stephenson, Richard M.; Malanowski, Stanislaw,
Handbook of the Thermodynamics of Organic Compounds, 1987, https://doi.org/10.1007/978-94-009-3173-2
. [all data]
Danov, Matin, et al., 1969
Danov, S.M.; Matin, N.B.; Efremov, R.V.; Slashchinina, K.K.,
Zh. Fiz. Khim., 1969, 43, 3, 733. [all data]
Boublik, Fried, et al., 1984
Boublik, T.; Fried, V.; Hala, E.,
The Vapour Pressures of Pure Substances: Selected Values of the Temperature Dependence of the Vapour Pressures of Some Pure Substances in the Normal and Low Pressure Region, 2nd ed., Elsevier, New York, 1984, 972. [all data]
McDonald, Shrader, et al., 1959, 2
McDonald, R.A.; Shrader, S.A.; Stull, D.R.,
Vapor Pressures and Freezing Points of Thirty Pure Organic Compounds.,
J. Chem. Eng. Data, 1959, 4, 4, 311-313, https://doi.org/10.1021/je60004a009
. [all data]
Sunner, Kulatunga, et al., 1986
Sunner, J.A.; Kulatunga, R.; Kebarle, P.,
Fast Atom Bombardment Mass Spectrometry and Gas Phase Basicities,
Anal. Chem., 1986, 58, 7, 1312, https://doi.org/10.1021/ac00298a010
. [all data]
Hunter and Lias, 1998
Hunter, E.P.; Lias, S.G.,
Evaluated Gas Phase Basicities and Proton Affinities of Molecules: An Update,
J. Phys. Chem. Ref. Data, 1998, 27, 3, 413-656, https://doi.org/10.1063/1.556018
. [all data]
Anderson, Jurel, et al., 1973
Anderson, A.; Jurel, S.; Shymanska, M.; Golender, L.,
Gas-liquid chromatography of some aliphatic and heterocyclic mono- and pollyfunctional amines. VII. Retention indices of amines in some polar and unpolar stationary phases,
Latv. PSR Zinat. Akad. Vestis Kim. Ser., 1973, 1, 51-63. [all data]