1,2-Ethanediamine, N-(2-aminoethyl)-
- Formula: C4H13N3
- Molecular weight: 103.1661
- IUPAC Standard InChIKey: RPNUMPOLZDHAAY-UHFFFAOYSA-N
- CAS Registry Number: 111-40-0
- Chemical structure:
View 3d structure (requires JavaScript / HTML 5) - Other names: Diethylenetriamine; Barsamide 115; Bis(2-aminoethyl)amine; Bis[β-aminoethyl]amine; N,N-Bis(2-aminoethyl)amine; 2,2'-Diaminodiethylamine; 3-Azapentane-1,5-diamine; 2,2'-Iminodiethylamine; (Aminoethyl)ethanediamine; Diethylamine, 2,2'-diamino-; DETA; Ethylamine, 2,2'-iminobis-; Ethylenediamine, N-(2-aminoethyl)-; Aminoethylethandiamine; D.E.H. 20; UN 2079; 1,4,7-Triazaheptane; 1,5-Diamino-3-azapentane; N-(2-Aminoethyl)-1,2-ethanediamine; ChS-P 1; N-(2-Aminoethyl)ethylenediamine; β,β'-Diaminodiethylamine; 2,2'-Iminobisethylamine; Texacure EA-20; 1,2-Ethanediamine, N1-(2-aminoethyl)-; NSC 446; H 9506; Epon 3223; Epicure T; DEH 20; Ancamine DETA; 2,2'-Iminobis(ethanamine); 2-(2-Aminoethylamino)ethylamine

Condensed phase thermochemistry data

Data compiled as indicated in comments:
ALS - Hussein Y. Afeefy, Joel F. Liebman, and Stephen E. Stein
DH - Eugene S. Domalski and Elizabeth D. Hearing
Quantity | Value | Units | Method | Reference | Comment |
---|---|---|---|---|---|
ΔfH°liquid | -65.2 ± 0.5 | kJ/mol | Ccb | Gutner, Lebedeva, et al., 1979 | ALS |
ΔfH°liquid | -287.0 | kJ/mol | Ccr | Baroody and Carpenter, 1976 | ALS |
Quantity | Value | Units | Method | Reference | Comment |
ΔcH°liquid | -3366.7 ± 0.5 | kJ/mol | Ccb | Gutner, Lebedeva, et al., 1979 | ALS |
Constant pressure heat capacity of liquid
Cp,liquid (J/mol*K) | Temperature (K) | Reference | Comment |
---|---|---|---|
254. | 313. | Bobylev, Kamskaya, et al., 1988 | T = 313 to 493 K.; DH |

Phase change data

Data compiled as indicated in comments:
BS - Robert L. Brown and Stephen E. Stein
TRC - Thermodynamics Research Center, NIST Boulder Laboratories, Chris Muzny director
AC - William E. Acree, Jr., James S. Chickos
Quantity | Value | Units | Method | Reference | Comment |
---|---|---|---|---|---|
Tboil | 477.2 | K | N/A | Aldrich Chemical Company Inc., 1990 | BS |
Tboil | 480.15 | K | N/A | Anderson and Shimanskaya, 1969 | Uncertainty assigned by TRC = 2. K; TRC |
Quantity | Value | Units | Method | Reference | Comment |
Tc | 677. | K | N/A | Steele, Chirico, et al., 1997 | Uncertainty assigned by TRC = 6. K; TRC |
Quantity | Value | Units | Method | Reference | Comment |
Pc | 30.50 | bar | N/A | Steele, Chirico, et al., 1997 | Uncertainty assigned by TRC = 2.50 bar; derived from fit of obs. vapor pressure; TRC |
Quantity | Value | Units | Method | Reference | Comment |
ρc | 2.78 | mol/l | N/A | Steele, Chirico, et al., 1997 | Uncertainty assigned by TRC = 0.15 mol/l; TRC |
Quantity | Value | Units | Method | Reference | Comment |
ΔvapH° | 63.4 ± 0.7 | kJ/mol | EB | Ribeiro da Silva, Matos, et al., 1999 | Based on data from 371. to 521. K.; AC |
Enthalpy of vaporization
ΔvapH (kJ/mol) | Temperature (K) | Method | Reference | Comment |
---|---|---|---|---|
54.8 | 386. | A | Stephenson and Malanowski, 1987 | Based on data from 371. to 441. K.; AC |

Reaction thermochemistry data

Data compiled by: Hussein Y. Afeefy, Joel F. Liebman, and Stephen E. Stein
Individual Reactions
By formula: C4H13N3 + C2H5N = C6H18N4
Quantity | Value | Units | Method | Reference | Comment |
---|---|---|---|---|---|
ΔrH° | 83.3 ± 4.2 | kJ/mol | Cm | Dalin, Bobylev, et al., 1988 | liquid phase; solvent: Aqueous HCl; Kinetic |
By formula: C2H8N2 + C2H5N = C4H13N3
Quantity | Value | Units | Method | Reference | Comment |
---|---|---|---|---|---|
ΔrH° | 82.8 ± 5.0 | kJ/mol | Cm | Dalin, Bobylev, et al., 1988 | liquid phase; solvent: Aqueous HCl; Kinetic |

Kovats' RI, non-polar column, isothermal

Column type | Active phase | Temperature (C) | I | Reference | Comment |
---|---|---|---|---|---|
Packed | PMS-100 | 150. | 1030. | Anderson, Jurel, et al., 1973 | He, Celite 545 (44-60 mesh); Column length: 3. m |
Packed | PMS-100 | 180. | 1028. | Anderson, Jurel, et al., 1973 | He, Celite 545 (44-60 mesh); Column length: 3. m |
Packed | PMS-100 | 200. | 1025. | Anderson, Jurel, et al., 1973 | He, Celite 545 (44-60 mesh); Column length: 3. m |

Kovats' RI, polar column, isothermal

Column type | Active phase | Temperature (C) | I | Reference | Comment |
---|---|---|---|---|---|
Packed | PEG-2000 | 150. | 1729. | Anderson, Jurel, et al., 1973 | He, Celite 545 (44-60 mesh); Column length: 3. m |
Packed | PEG-2000 | 152. | 1763. | Anderson, Jurel, et al., 1973 | He, Celite 545 (44-60 mesh); Column length: 3. m |
Packed | PEG-2000 | 179. | 1748. | Anderson, Jurel, et al., 1973 | He, Celite 545 (44-60 mesh); Column length: 3. m |
Packed | PEG-2000 | 180. | 1731. | Anderson, Jurel, et al., 1973 | He, Celite 545 (44-60 mesh); Column length: 3. m |
Packed | PEG-2000 | 200. | 1727. | Anderson, Jurel, et al., 1973 | He, Celite 545 (44-60 mesh); Column length: 3. m |
Packed | PEG-2000 | 200. | 1734. | Anderson, Jurel, et al., 1973 | He, Celite 545 (44-60 mesh); Column length: 3. m |

References

Gutner, Lebedeva, et al., 1979
Gutner, N.M.; Lebedeva, N.D.; Kiseleva, N.N.,
Enthalpies of combustion and formation of some acyl-substituted diamines,
Termodin. Org. Soedin., 1979, 97-98. [all data]
Baroody and Carpenter, 1976
Baroody, E.E.; Carpenter, G.A.,
Heats of formation of propellant compounds (U), Rpt. NCWC/WOL-TR-76-77 by Naval Surface Weapons Center, Silver Spring, MD, 1976, 1-20. [all data]
Bobylev, Kamskaya, et al., 1988
Bobylev, V.A.; Kamskaya, O.I.; Kossoi, A.A.; Koludarova, E.Yu.,
Investigation of the heat capacity of ethyleneamines by differential scanning calorimetry,
Zhur. Obshch. Khim., 1988, 58, 2536-2538. [all data]
Aldrich Chemical Company Inc., 1990
Aldrich Chemical Company Inc.,
Catalog Handbook of Fine Chemicals, Aldrich Chemical Company, Inc., Milwaukee WI, 1990, 1. [all data]
Anderson and Shimanskaya, 1969
Anderson, A.A.; Shimanskaya, M.V.,
Gas-Liquid Chromatography of some Aliphatic and Heterocyclic Polyfunctional Amines: II. Solution Thermodyn. of Amines in Fix. Phas.,
Latv. PSR Zinat. Akad. Vestis, Kim. Ser., 1969, No. 5, 527. [all data]
Steele, Chirico, et al., 1997
Steele, W.V.; Chirico, R.D.; Knipmeyer, S.E.; Nguyen, A.; Smith, N.K.,
Thermocynamic Properties and Ideal-Gas Enthalpies of Formation for Carbonate, Piperazine, Hexachloroprop-1-ene, Tetrakis(dimethylamino) ethylene, N,N'-Bis(2-hydroxyethyl)ethylenediamine, and 1,2,4-Tr,
J. Chem. Eng. Data, 1997, 42, 1037-52. [all data]
Ribeiro da Silva, Matos, et al., 1999
Ribeiro da Silva, M.A.V.; Matos, M.A.R.; Morais, V.M.F.; Miranda, M.S.,
Thermochemical and Theoretical Study of tert -Butyl and Di- tert -butylphenol Isomers,
J. Org. Chem., 1999, 64, 24, 8816-8820, https://doi.org/10.1021/jo990801o
. [all data]
Stephenson and Malanowski, 1987
Stephenson, Richard M.; Malanowski, Stanislaw,
Handbook of the Thermodynamics of Organic Compounds, 1987, https://doi.org/10.1007/978-94-009-3173-2
. [all data]
Dalin, Bobylev, et al., 1988
Dalin, A.R.; Bobylev, V.A.; Suslikov, V.F.; Kamskaya, O.I.; Tereshchenko, G.F.,
Nucleophilic cleavage and the formation of saturated heterocycles. VII. Kinetic and thermochemical study of reactions of aziridine with ethylene amines,
J. Gen. Chem. USSR, 1988, 58, 1868-1871. [all data]
Anderson, Jurel, et al., 1973
Anderson, A.; Jurel, S.; Shymanska, M.; Golender, L.,
Gas-liquid chromatography of some aliphatic and heterocyclic mono- and pollyfunctional amines. VII. Retention indices of amines in some polar and unpolar stationary phases,
Latv. PSR Zinat. Akad. Vestis Kim. Ser., 1973, 1, 51-63. [all data]