Acetamide, N-acetyl-N-methyl-
- Formula: C5H9NO2
- Molecular weight: 115.1305
- IUPAC Standard InChIKey: ZNQFZPCFVNOXJQ-UHFFFAOYSA-N
- CAS Registry Number: 1113-68-4
- Chemical structure:
View 3d structure (requires JavaScript / HTML 5) - Other names: Diacetamide, N-methyl-; N-Methyldiacetamide; N,N-Diacetylmethylamine; N-Methyl-N-acetylacetamide; N-acetyl-N-methylacetamide

Phase change data

Data compiled by: Robert L. Brown and Stephen E. Stein
Quantity | Value | Units | Method | Reference | Comment |
---|---|---|---|---|---|
Tboil | 465. to 467. | K | N/A | Frinton Laboratories Inc., 1986 |

References

Frinton Laboratories Inc., 1986
Frinton Laboratories Inc.,
Catalog Number 11, Frinton Laboratories Inc., Vineland, NJ, 1986, 99. [all data]