Borane, ethyldimethyl-
- Formula: C4H11B
- Molecular weight: 69.941
- IUPAC Standard InChIKey: QOROTCSPKMPOQB-UHFFFAOYSA-N
- CAS Registry Number: 1113-22-0
- Chemical structure:
View 3d structure (requires JavaScript / HTML 5) - Other names: Dimethylethylborane; Borine, ethyldimethyl-

Normal alkane RI, non-polar column, custom temperature program

Column type | Active phase | I | Reference | Comment |
---|---|---|---|---|
Capillary | Methyl Silicone | 439. | Zenkevich, 1996 | Program: not specified |

References

Zenkevich, 1996
Zenkevich, I.G.,
Informational Maitenance of Gas Chromatographic Identification of Organic Compounds in Ecoanalytical Investigations,
Z. Anal. Chem., 1996, 51, 11, 1140-1148. [all data]