1-Butanol, 4-methoxy-
- Formula: C5H12O2
- Molecular weight: 104.1476
- IUPAC Standard InChIKey: KOVAQMSVARJMPH-UHFFFAOYSA-N
- CAS Registry Number: 111-32-0
- Chemical structure:
View 3d structure (requires JavaScript / HTML 5) - Other names: Dowanol BMAT; 4-Methoxy-1-butanol; 4-Methoxybutanol-1; Butylene glycol methyl ether; Butylene glycol monomethyl ether; Dowanol bm; 4-Methoxybutanol; 4-Methoxybutyl alcohol; NSC 245191; 4-methoxybutan-1-ol

Normal alkane RI, non-polar column, temperature ramp

Column type | Active phase | I | Reference | Comment |
---|---|---|---|---|
Capillary | Ultra-ALLOY-5 | 886. | Tsuge, Ohtan, et al., 2011 | 30. m/0.25 mm/0.25 μm, 40. C @ 2. min, 20. K/min, 320. C @ 13. min |

References

Tsuge, Ohtan, et al., 2011
Tsuge, S.; Ohtan, H.; Watanabe, C.,
Pyrolysis - GC/MS Data Book of Synthetic Polymers, Elsevier, 2011, 420. [all data]