1-Hexanethiol
- Formula: C6H14S
- Molecular weight: 118.240
- IUPAC Standard InChIKey: PMBXCGGQNSVESQ-UHFFFAOYSA-N
- CAS Registry Number: 111-31-9
- Chemical structure:
View 3d structure (requires JavaScript / HTML 5) - Other names: n-Hexyl mercaptan; n-Hexylthiol; Hexan-1-thiol; Hexanethiol; Hexyl mercaptan; USAF EK-4628; 1-Hexylthiol; n-Hexanethiol; hexane-1-thiol

Gas phase thermochemistry data

Data compiled by: Hussein Y. Afeefy, Joel F. Liebman, and Stephen E. Stein
Quantity | Value | Units | Method | Reference | Comment |
---|---|---|---|---|---|
ΔfH°gas | -129.3 ± 0.96 | kJ/mol | Ccr | Good and DePrater, 1966 |

Condensed phase thermochemistry data

Data compiled as indicated in comments:
ALS - Hussein Y. Afeefy, Joel F. Liebman, and Stephen E. Stein
DH - Eugene S. Domalski and Elizabeth D. Hearing
Quantity | Value | Units | Method | Reference | Comment |
---|---|---|---|---|---|
ΔfH°liquid | -175.7 ± 0.92 | kJ/mol | Ccr | Good and DePrater, 1966 | Reanalyzed by Cox and Pilcher, 1970, Original value = -175.1 ± 0.92 kJ/mol; ALS |
Quantity | Value | Units | Method | Reference | Comment |
ΔcH°liquid | -4788.50 ± 0.75 | kJ/mol | Ccr | Good and DePrater, 1966 | ALS |
Quantity | Value | Units | Method | Reference | Comment |
S°liquid | 343.21 | J/mol*K | N/A | Finke, McCullough, et al., 1970 | DH |
Constant pressure heat capacity of liquid
Cp,liquid (J/mol*K) | Temperature (K) | Reference | Comment |
---|---|---|---|
230.71 | 298.15 | Finke, McCullough, et al., 1970 | T = 10 to 370 K.; DH |
230.68 | 298.15 | Good and DePrater, 1966 | DH |

Phase change data

Data compiled as indicated in comments:
BS - Robert L. Brown and Stephen E. Stein
TRC - Thermodynamics Research Center, NIST Boulder Laboratories, Chris Muzny director
DRB - Donald R. Burgess, Jr.
AC - William E. Acree, Jr., James S. Chickos
DH - Eugene S. Domalski and Elizabeth D. Hearing
Quantity | Value | Units | Method | Reference | Comment |
---|---|---|---|---|---|
Tboil | 424.2 | K | N/A | Weast and Grasselli, 1989 | BS |
Tboil | 425.75 | K | N/A | Morris, Lanum, et al., 1960 | Uncertainty assigned by TRC = 0.2 K; TRC |
Tboil | 420. | K | N/A | Mann and Purdie, 1935 | Uncertainty assigned by TRC = 2. K; TRC |
Quantity | Value | Units | Method | Reference | Comment |
Tfus | 192.66 | K | N/A | Morris, Lanum, et al., 1960 | Uncertainty assigned by TRC = 0.02 K; meas. by Thermodynamics Lab., Bartlesville OK; TRC |
Tfus | 192.12 | K | N/A | Teets, 1934 | Uncertainty assigned by TRC = 0.3 K; TRC |
Tfus | 192.2 | K | N/A | Ellis and Reid, 1932 | Uncertainty assigned by TRC = 0.3 K; TRC |
Quantity | Value | Units | Method | Reference | Comment |
Ttriple | 192.62 | K | N/A | Finke, McCullough, et al., 1970, 2 | Uncertainty assigned by TRC = 0.02 K; TRC |
Quantity | Value | Units | Method | Reference | Comment |
ΔvapH° | 46.4 | kJ/mol | N/A | Good and DePrater, 1966 | DRB |
ΔvapH° | 44.8 ± 0.2 | kJ/mol | N/A | Good and DePrater, 1966 | See also Osborn and Douslin, 1966.; AC |
Enthalpy of vaporization
ΔvapH (kJ/mol) | Temperature (K) | Method | Reference | Comment |
---|---|---|---|---|
43.9 | 335. | N/A | Dykyj, Svoboda, et al., 1999 | Based on data from 320. to 454. K.; AC |
42.4 | 367. | A,EB | Stephenson and Malanowski, 1987 | Based on data from 352. to 468. K. See also Osborn and Douslin, 1966.; AC |
Antoine Equation Parameters
log10(P) = A − (B / (T + C))
P = vapor pressure (bar)
T = temperature (K)
View plot Requires a JavaScript / HTML 5 canvas capable browser.
Temperature (K) | A | B | C | Reference |
---|---|---|---|---|
353.84 to 467.64 | 4.07154 | 1454.004 | -68.196 | Osborn and Douslin, 1966 |
Enthalpy of fusion
ΔfusH (kJ/mol) | Temperature (K) | Reference | Comment |
---|---|---|---|
18.012 | 192.62 | Finke, McCullough, et al., 1970 | DH |
18.03 | 192.6 | Domalski and Hearing, 1996 | AC |
Entropy of fusion
ΔfusS (J/mol*K) | Temperature (K) | Reference | Comment |
---|---|---|---|
93.51 | 192.62 | Finke, McCullough, et al., 1970 | DH |

Reaction thermochemistry data

Data compiled by: Hussein Y. Afeefy, Joel F. Liebman, and Stephen E. Stein
Individual Reactions
=
By formula: C6H14S = C6H14S
Quantity | Value | Units | Method | Reference | Comment |
---|---|---|---|---|---|
ΔrH° | -18.01 ± 0.03 | kJ/mol | Cm | Finke, McCullough, et al., 1970 | liquid phase; Heat of solidification |

Kovats' RI, non-polar column, isothermal

Column type | Active phase | Temperature (C) | I | Reference | Comment |
---|---|---|---|---|---|
Capillary | DB-5 | 100. | 920.9 | Miller and Bruno, 2003 | 30. m/0.25 mm/0.1 μm |
Capillary | DB-5 | 120. | 927.3 | Miller and Bruno, 2003 | 30. m/0.25 mm/0.1 μm |
Capillary | DB-5 | 60. | 912.5 | Miller and Bruno, 2003 | 30. m/0.25 mm/0.1 μm |
Capillary | DB-5 | 80. | 916.4 | Miller and Bruno, 2003 | 30. m/0.25 mm/0.1 μm |
Packed | C78, Branched paraffin | 130. | 920.4 | Dallos, Sisak, et al., 2000 | He; Column length: 3.3 m |
Packed | C78, Branched paraffin | 130. | 922.0 | Reddy, Dutoit, et al., 1992 | Chromosorb G HP; Column length: 3.3 m |
Packed | Apolane | 130. | 925. | Dutoit, 1991 | Column length: 3.7 m |
Packed | SE-30 | 170. | 918. | Voelkel, 1987 | He, Chromaton N Super (75-100 mesh); Column length: 1. m |
Packed | Apiezon M | 130. | 930. | Garbuzov, Misharina, et al., 1985 | He or N2, Chromosorb W, AW-DMCS; Column length: 2.1 m |
Packed | Apiezon M | 130. | 929. | Golovnya and Garbuzov, 1974 | N2, Chromosorb W; Column length: 2.1 m |
Packed | DC-200 | 120. | 917. | Golovnya and Arsen'ev, 1970 | Column length: 1.5 m |
Packed | DC-200 | 60. | 904. | Golovnya and Arsen'ev, 1970 | Column length: 1.5 m |
Packed | SE-30 | 130. | 918. | Golovnya and Arsen'ev, 1970 | Column length: 1.5 m |
Packed | SE-30 | 60. | 904. | Golovnya and Arsen'ev, 1970 | Column length: 1.5 m |

Kovats' RI, non-polar column, custom temperature program

Column type | Active phase | I | Reference | Comment |
---|---|---|---|---|
Capillary | Apiezon M | 930. | Zhu, Wang, et al., 2007 | Program: not specified |

Kovats' RI, polar column, isothermal

Column type | Active phase | Temperature (C) | I | Reference | Comment |
---|---|---|---|---|---|
Capillary | PEG-20M | 93. | 1153.2 | Morishita, Murakita, et al., 1985 | Column length: 50. m; Column diameter: 0.25 mm |
Capillary | PEG-20M | 80. | 1148. | Morishita, Murakita, et al., 1982 | N2; Column length: 50. m; Column diameter: 0.25 mm |
Packed | Carbowax 20M | 110. | 1140. | Möckel and Zolg, 1977 | He, Chromosorb W AW (80-100 mesh); Column length: 6. m |

Kovats' RI, polar column, custom temperature program

Column type | Active phase | I | Reference | Comment |
---|---|---|---|---|
Capillary | PEG-20M | 1165. | Zhu, Wang, et al., 2007 | Program: not specified |

Normal alkane RI, non-polar column, isothermal

Column type | Active phase | Temperature (C) | I | Reference | Comment |
---|---|---|---|---|---|
Capillary | Polydimethyl siloxane with 5 % Ph groups | 100. | 921. | Safa and Hadjmohannadi, 2005 | 30. m/0.25 mm/0.10 μm, Nitrogen |
Capillary | Polydimethyl siloxane with 5 % Ph groups | 120. | 927. | Safa and Hadjmohannadi, 2005 | 30. m/0.25 mm/0.10 μm, Nitrogen |
Capillary | Polydimethyl siloxane with 5 % Ph groups | 60. | 912. | Safa and Hadjmohannadi, 2005 | 30. m/0.25 mm/0.10 μm, Nitrogen |
Capillary | Polydimethyl siloxane with 5 % Ph groups | 80. | 916. | Safa and Hadjmohannadi, 2005 | 30. m/0.25 mm/0.10 μm, Nitrogen |
Capillary | DC-200 | 50. | 903. | Leppin, Gollnick, et al., 1969 | Argon; Column length: 100. m |

Normal alkane RI, non-polar column, temperature ramp

Column type | Active phase | I | Reference | Comment |
---|---|---|---|---|
Capillary | OV-101 | 901. | Tamura, Nakamoto, et al., 1995 | N2, 2. K/min; Column length: 50. m; Column diameter: 0.25 mm; Tstart: 80. C; Tend: 200. C |
Capillary | OV-101 | 908. | Tamura, Nakamoto, et al., 1995 | N2, 2. K/min; Column length: 50. m; Column diameter: 0.25 mm; Tstart: 80. C; Tend: 200. C |
Capillary | OV-101 | 909. | Sugisawa, Nakamura, et al., 1990 | Nitrogen, 2. K/min; Column length: 50. m; Column diameter: 0.25 mm; Tstart: 70. C; Tend: 200. C |
Capillary | OV-101 | 909. | Sugisawa, Nakamura, et al., 1990 | Nitrogen, 2. K/min; Column length: 50. m; Column diameter: 0.25 mm; Tstart: 80. C; Tend: 200. C |

Normal alkane RI, non-polar column, custom temperature program

Column type | Active phase | I | Reference | Comment |
---|---|---|---|---|
Capillary | SE-30 | 910. | Vinogradov, 2004 | Program: not specified |
Capillary | Polydimethyl siloxanes | 920. | Zenkevich, 1998 | Program: not specified |

Normal alkane RI, polar column, custom temperature program

Column type | Active phase | I | Reference | Comment |
---|---|---|---|---|
Capillary | Carbowax 20M | 1145. | Vinogradov, 2004 | Program: not specified |

References

Good and DePrater, 1966
Good, W.D.; DePrater, B.L.,
The enthalpies of combustion and formation of the 1-alkanethiols. The methylene increment to the enthalpy of formation,
J. Phys. Chem., 1966, 70, 3606-3609. [all data]
Cox and Pilcher, 1970
Cox, J.D.; Pilcher, G.,
Thermochemistry of Organic and Organometallic Compounds, Academic Press, New York, 1970, 1-636. [all data]
Finke, McCullough, et al., 1970
Finke, H.L.; McCullough, J.P.; Messerly, J.F.; Gutherie, G.B.; Douslin, D.R.,
Chemical thermodynamic properties for 1-alkanethiols,
J. Chem. Thermodyn., 1970, 2, 27-41. [all data]
Weast and Grasselli, 1989
CRC Handbook of Data on Organic Compounds, 2nd Editon, Weast,R.C and Grasselli, J.G., ed(s)., CRC Press, Inc., Boca Raton, FL, 1989, 1. [all data]
Morris, Lanum, et al., 1960
Morris, J.C.; Lanum, W.J.; Helm, R.V.; Haines, W.E.; Cook, G.L.; Ball, J.S.,
Purification and Properties of Ten Organic Sulfur Compounds,
J. Chem. Eng. Data, 1960, 5, 112-6. [all data]
Mann and Purdie, 1935
Mann, F.G.; Purdie, D.,
The Constitution of Complex Metallic Salts III. The Parachors of Palladium and Mercury in Simple and Complex Compounds,
J. Chem. Soc., 1935, 1935, 1549. [all data]
Teets, 1934
Teets, D.E.,
The Relation of the Melting Point to the Number of Carbon Atoms in a Series of Normal Mercaptans,
J. Am. Chem. Soc., 1934, 56, 1143. [all data]
Ellis and Reid, 1932
Ellis, L.M.; Reid, E.E.,
The Preparation and Properties of A Double Series of Aliphatic Mercaptans,
J. Am. Chem. Soc., 1932, 54, 1674. [all data]
Finke, McCullough, et al., 1970, 2
Finke, H.L.; McCullough, J.P.; Messerly, J.F.; Guthrie, G.B.; Douslin, D.R.,
Chemical thermodynamic properties for 1-alkanethiols,
J. Chem. Thermodyn., 1970, 2, 27. [all data]
Osborn and Douslin, 1966
Osborn, A.G.; Douslin, D.R.,
Vapor Pressure Relations of 36 Sulfur Compounds Present in Petroleum.,
J. Chem. Eng. Data, 1966, 11, 4, 502-509, https://doi.org/10.1021/je60031a014
. [all data]
Dykyj, Svoboda, et al., 1999
Dykyj, J.; Svoboda, J.; Wilhoit, R.C.; Frenkel, M.L.; Hall, K.R.,
Vapor Pressure of Chemicals: Part A. Vapor Pressure and Antoine Constants for Hydrocarbons and Sulfur, Selenium, Tellurium and Hydrogen Containing Organic Compounds, Springer, Berlin, 1999, 373. [all data]
Stephenson and Malanowski, 1987
Stephenson, Richard M.; Malanowski, Stanislaw,
Handbook of the Thermodynamics of Organic Compounds, 1987, https://doi.org/10.1007/978-94-009-3173-2
. [all data]
Domalski and Hearing, 1996
Domalski, Eugene S.; Hearing, Elizabeth D.,
Heat Capacities and Entropies of Organic Compounds in the Condensed Phase. Volume III,
J. Phys. Chem. Ref. Data, 1996, 25, 1, 1, https://doi.org/10.1063/1.555985
. [all data]