Glutaraldehyde
- Formula: C5H8O2
- Molecular weight: 100.1158
- IUPAC Standard InChIKey: SXRSQZLOMIGNAQ-UHFFFAOYSA-N
- CAS Registry Number: 111-30-8
- Chemical structure:
View 3d structure (requires JavaScript / HTML 5) - Other names: Pentanedial; Glutaral; Aldesan; Alhydex; Cidex; Glutardialdehyde; Glutaric acid dialdehyde; Glutaric aldehyde; Glutaric dialdehyde; Hospex; Sonacide; 1,5-Pentanedial; 1,5-Pentanedione; component of Cidex; Glutaraldehyd; Glutarol; NCI-C55425; Ucarcide; Aqucar; Glutarex 28; Relugan GT; Relugan GT 50; Sporicidin; Cidex 7; Ucarcide 250; Relugan GTW; Glutaclean; Sterihyde; 1,3-Diformylpropane; Coldcide-25 microbiocide; Glutaralum; Gluteraldehyde; Novaruca; Pentane-1,5-dial; Potentiated acid glutaraldehyde; Veruca-sep; NSC 13392

Phase change data

Data compiled as indicated in comments:
BS - Robert L. Brown and Stephen E. Stein
TRC - Thermodynamics Research Center, NIST Boulder Laboratories, Chris Muzny director
AC - William E. Acree, Jr., James S. Chickos
Quantity | Value | Units | Method | Reference | Comment |
---|---|---|---|---|---|
Tboil | 374.2 | K | N/A | Aldrich Chemical Company Inc., 1990 | BS |
Quantity | Value | Units | Method | Reference | Comment |
Tfus | 267.4 | K | N/A | Anonymous, 1954 | Uncertainty assigned by TRC = 0.6 K; TRC |
Enthalpy of vaporization
ΔvapH (kJ/mol) | Temperature (K) | Reference | Comment |
---|---|---|---|
51.4 | 362. | Olson, 1998 | Based on data from 347. to 382. K.; AC |
56.2 | 342. | Olson, 1998 | Based on data from 327. to 436. K.; AC |

References

Aldrich Chemical Company Inc., 1990
Aldrich Chemical Company Inc.,
Catalog Handbook of Fine Chemicals, Aldrich Chemical Company, Inc., Milwaukee WI, 1990, 1. [all data]
Anonymous, 1954
Anonymous, R.,
, Am. Pet. Inst. Res. Proj. 45, Tech. Rep. 13, Ohio State Univ., 1954. [all data]
Olson, 1998
Olson, James D.,
The vapor pressure of pure and aqueous glutaraldehyde,
Fluid Phase Equilibria, 1998, 150-151, 713-720, https://doi.org/10.1016/S0378-3812(98)00351-3
. [all data]