1,5-Pentanediol
- Formula: C5H12O2
- Molecular weight: 104.1476
- IUPAC Standard InChIKey: ALQSHHUCVQOPAS-UHFFFAOYSA-N
- CAS Registry Number: 111-29-5
- Chemical structure:
View 3d structure (requires JavaScript / HTML 5) - Other names: α,ω-Pentanediol; Pentamethylene glycol; Pentylene glycol; 1,5-Dihydroxypentane; 1,5-Pentamethylene glycol; Pentane-1,5-diol; 1,5-Pentandiol; 1,5-Pentylene glycol; Pentane diol-1,5; NSC 5927

Gas phase thermochemistry data

Data compiled as indicated in comments:
ALS - Hussein Y. Afeefy, Joel F. Liebman, and Stephen E. Stein
DRB - Donald R. Burgess, Jr.
Quantity | Value | Units | Method | Reference | Comment |
---|---|---|---|---|---|
ΔfH°gas | -442.0 ± 5.7 | kJ/mol | Ccr | Knauth and Sabbah, 1990 | see Knauth and Sabbah, 1989; ALS |
ΔfH°gas | -449. ± 3. | kJ/mol | Ccb | Gardner and Hussain, 1972 | ALS |
ΔfH°gas | -444.5 | kJ/mol | N/A | Miller, 1936 | Value computed using ΔfHliquid° value of -526.5 kj/mol from Miller, 1936 and ΔvapH° value of 82.0 kj/mol from Gardner and Hussain, 1972.; DRB |

Condensed phase thermochemistry data

Data compiled as indicated in comments:
ALS - Hussein Y. Afeefy, Joel F. Liebman, and Stephen E. Stein
DH - Eugene S. Domalski and Elizabeth D. Hearing
Quantity | Value | Units | Method | Reference | Comment |
---|---|---|---|---|---|
ΔfH°liquid | -528.8 ± 5.7 | kJ/mol | Ccr | Knauth and Sabbah, 1990 | see Knauth and Sabbah, 1989; ALS |
ΔfH°liquid | -531. ± 3. | kJ/mol | Ccb | Gardner and Hussain, 1972 | ALS |
ΔfH°liquid | -526.51 | kJ/mol | Ccb | Miller, 1936 | %hf calculated possible error by author; ALS |
Quantity | Value | Units | Method | Reference | Comment |
ΔcH°liquid | -3153.7 ± 5.7 | kJ/mol | Ccr | Knauth and Sabbah, 1990 | see Knauth and Sabbah, 1989; Corresponding ΔfHºliquid = -528.8 kJ/mol (simple calculation by NIST; no Washburn corrections); ALS |
ΔcH°liquid | -3151.1 ± 2.8 | kJ/mol | Ccb | Gardner and Hussain, 1972 | Corresponding ΔfHºliquid = -531.49 kJ/mol (simple calculation by NIST; no Washburn corrections); ALS |
ΔcH°liquid | -3156. | kJ/mol | Ccb | Miller, 1936 | %hf calculated possible error by author; Corresponding ΔfHºliquid = -526.3 kJ/mol (simple calculation by NIST; no Washburn corrections); ALS |
Quantity | Value | Units | Method | Reference | Comment |
S°liquid | 321.3 | J/mol*K | N/A | Miller, 1935 | Extrapolation below 90 K, 78.49 J/mol*K.; DH |

Phase change data

Data compiled as indicated in comments:
BS - Robert L. Brown and Stephen E. Stein
TRC - Thermodynamics Research Center, NIST Boulder Laboratories, Chris Muzny director
DRB - Donald R. Burgess, Jr.
AC - William E. Acree, Jr., James S. Chickos
ALS - Hussein Y. Afeefy, Joel F. Liebman, and Stephen E. Stein
DH - Eugene S. Domalski and Elizabeth D. Hearing
Quantity | Value | Units | Method | Reference | Comment |
---|---|---|---|---|---|
Tboil | 512. ± 7. | K | AVG | N/A | Average of 8 values; Individual data points |
Quantity | Value | Units | Method | Reference | Comment |
Tfus | 378. | K | N/A | Lipkin and Layloff, 1970 | Uncertainty assigned by TRC = 2. K; TRC |
Tfus | 257.55 | K | N/A | Mellan, 1962 | Uncertainty assigned by TRC = 0.6 K; TRC |
Quantity | Value | Units | Method | Reference | Comment |
Ttriple | 254.4 | K | N/A | Knauth and Sabbah, 1990, 2 | Uncertainty assigned by TRC = 0.1 K; TRC |
Ttriple | 248.0 | K | N/A | Nitta, Seki, et al., 1950 | Uncertainty assigned by TRC = 0.2 K; TRC |
Ttriple | 248. | K | N/A | Miller, 1936, 2 | Uncertainty assigned by TRC = 0.4 K; TRC |
Quantity | Value | Units | Method | Reference | Comment |
ΔvapH° | 86.8 | kJ/mol | N/A | Knauth and Sabbah, 1990 | DRB |
ΔvapH° | 86.8 ± 0.5 | kJ/mol | C | Knauth and Sabbah, 1988 | See also Knauth and Sabbah, 1990.; AC |
ΔvapH° | 86.8 ± 0.5 | kJ/mol | C | Knauth and Sabbah, 1988, 2 | ALS |
ΔvapH° | 82.0 | kJ/mol | N/A | Gardner and Hussain, 1972 | DRB |
Enthalpy of vaporization
ΔvapH (kJ/mol) | Temperature (K) | Method | Reference | Comment |
---|---|---|---|---|
78.6 | 406. | A | Stephenson and Malanowski, 1987 | Based on data from 391. to 479. K.; AC |
82. ± 2. | 446. | V | Gardner and Hussain, 1972 | ALS |
Enthalpy of fusion
ΔfusH (kJ/mol) | Temperature (K) | Reference | Comment |
---|---|---|---|
15.72 | 248. | Domalski and Hearing, 1996 | AC |
15.728 | 248.0 | Miller, 1935 | DH |
Entropy of fusion
ΔfusS (J/mol*K) | Temperature (K) | Reference | Comment |
---|---|---|---|
63.4 | 248.0 | Miller, 1935 | DH |

Kovats' RI, non-polar column, isothermal

Column type | Active phase | Temperature (C) | I | Reference | Comment |
---|---|---|---|---|---|
Packed | Apiezon L | 160. | 993. | Bogoslovsky, Anvaer, et al., 1978 | Celite 545 |
Packed | SE-30 | 175. | 1029. | Casteignau and Villessot, 1968 | Column length: 3. m |

Van Den Dool and Kratz RI, non-polar column, custom temperature program

Column type | Active phase | I | Reference | Comment |
---|---|---|---|---|
Capillary | DB-1 | 1016. | Peng, 2000 | 15. m/0.53 mm/1. μm, He; Program: 40C(3min) => 8C/min => 200(1min) => 5C/min => 300C(25min) |

Henry's Law data

Data compiled by: Rolf Sander
Henry's Law constant (water solution)
kH(T) = k°H exp(d(ln(kH))/d(1/T) ((1/T) - 1/(298.15 K)))
k°H = Henry's law constant for solubility in water at 298.15 K (mol/(kg*bar))
d(ln(kH))/d(1/T) = Temperature dependence constant (K)
k°H (mol/(kg*bar)) | d(ln(kH))/d(1/T) (K) | Method | Reference | Comment |
---|---|---|---|---|
4.0×10+6 | E | N/A | Value obtained by missing citation using the group contribution method. |

References

Knauth and Sabbah, 1990
Knauth, P.; Sabbah, R.,
Energetics of intra- and intermolecular bonds in ω-alkanediols (II) Thermochemical study of 1,2-ethanediol, 1,3-propanediol, 1,4-butanediol, and 1,5-pentanediol at 298.15K,
Struct. Chem., 1990, 1, 43-46. [all data]
Knauth and Sabbah, 1989
Knauth, P.; Sabbah, R.,
Combustion calorimetry on milligram samples of liquid substances with a CRMT rocking bomb calorimeter. Application to the study of ω-alkanediol at 298.15 K,
J. Chem. Thermodyn., 1989, 21, 203-210. [all data]
Gardner and Hussain, 1972
Gardner, P.J.; Hussain, K.S.,
The standard enthalpies of formation of some aliphatic diols,
J. Chem. Thermodyn., 1972, 4, 819-827. [all data]
Miller, 1936
Miller, P.,
The free energy of furfural and some of its derivatives,
Iowa State Coll. J. Sci., 1936, 10, 91-93. [all data]
Miller, 1935
Miller, P.,
The free energy of furfural and some of its derivatives,
Iowa State Coll. J. Sci., 1935, 10, 91-93. [all data]
Lipkin and Layloff, 1970
Lipkin, D.; Layloff, T.,
Cyclic Sulfite and Sulfate Esters of Polymethylene Glycols,
J. Chem. Eng. Data, 1970, 15, 450. [all data]
Mellan, 1962
Mellan, I.,
Polyhydric Alcohols, Spartan Books: Washington, DC, 1962. [all data]
Knauth and Sabbah, 1990, 2
Knauth, P.; Sabbah, R.,
Can. J. Chem., 1990, 68, 731. [all data]
Nitta, Seki, et al., 1950
Nitta, I.; Seki, S.; Momotani, M.,
The Phase Transition in Pentaerythritol I.,
Proc. Jpn. Acad., 1950, 26, 9, 25-9. [all data]
Miller, 1936, 2
Miller, P.,
The Free Energy of Furfural and Some of Its Derivatives,
Iowa State Coll. J. Sci., 1936, 10, 91-3. [all data]
Knauth and Sabbah, 1988
Knauth, P.; Sabbah, R.,
Energetics of intra- and intermolecular bonds in ω-alkanediols. I. Calorimetric investigation of the enthalpies of vaporization at 298.15 K,
Bull. Soc. Chim. Fr., 1988, 5, 834. [all data]
Knauth and Sabbah, 1988, 2
Knauth, P.; Sabbah, R.,
Energetique des liaisons intra- et intermoleculaires dans la serie des <omega>-alcanediols. I : etude calorimetrique des enthalpies de vaporisation a 298,15 K,
Bull. Soc. Chim. Fr., 1988, 834-836. [all data]
Stephenson and Malanowski, 1987
Stephenson, Richard M.; Malanowski, Stanislaw,
Handbook of the Thermodynamics of Organic Compounds, 1987, https://doi.org/10.1007/978-94-009-3173-2
. [all data]
Domalski and Hearing, 1996
Domalski, Eugene S.; Hearing, Elizabeth D.,
Heat Capacities and Entropies of Organic Compounds in the Condensed Phase. Volume III,
J. Phys. Chem. Ref. Data, 1996, 25, 1, 1, https://doi.org/10.1063/1.555985
. [all data]
Bogoslovsky, Anvaer, et al., 1978
Bogoslovsky, Yu.N.; Anvaer, B.I.; Vigdergauz, M.S.,
Chromatographic constants in gas chromatography (in Russian), Standards Publ. House, Moscow, 1978, 192. [all data]
Casteignau and Villessot, 1968
Casteignau, G.; Villessot, D.,
Identification par chromatographie en phase gaseuse de composés difonctionnels insaturés. I. Synthèse et indices de rétention,
Bull. Soc. Chim. Fr., 1968, 9, 3893-3903. [all data]
Peng, 2000
Peng, C.T.,
Prediction of retention indices. V. Influence of electronic effects and column polarity on retention index,
J. Chromatogr. A, 2000, 903, 1-2, 117-143, https://doi.org/10.1016/S0021-9673(00)00901-8
. [all data]