4-Methyl-2-pentanone dimethylacetal
- Formula: C8H18O2
- Molecular weight: 146.2273
- IUPAC Standard InChIKey: WCPUFSIDCWSGEW-UHFFFAOYSA-N
- CAS Registry Number: 1112-78-3
- Chemical structure:
View 3d structure (requires JavaScript / HTML 5) - Permanent link for this species. Use this link for bookmarking this species for future reference.

Reaction thermochemistry data

Data compiled by: Hussein Y. Afeefy, Joel F. Liebman, and Stephen E. Stein
Individual Reactions
By formula: C8H18O2 + H2O = C6H12O + 2CH4O
Quantity | Value | Units | Method | Reference | Comment |
---|---|---|---|---|---|
ΔrH° | 13.74 ± 0.054 | kJ/mol | Cm | Wiberg and Squires, 1979 | liquid phase |

References

Wiberg and Squires, 1979
Wiberg, K.B.; Squires, R.R.,
Thermodynamics of hydrolysis aliphatic ketals. An entropy component of steric effects,
J. Am. Chem. Soc., 1979, 101, 5512-5515. [all data]