Ag2Au radical

Gas phase ion energetics data

Data compiled by: John E. Bartmess

Electron affinity determinations

EA (eV) Method Reference Comment
2.840 ± 0.090LPESNegishi, Nakamura, et al., 2001Vertical Detachment Energy: 2.97±0.02 eV

References

Negishi, Nakamura, et al., 2001
Negishi, Y.; Nakamura, Y.; Nakajima, A.; Kaya, K., Photoelectron spectroscopy of gold-silver binary cluster anions (AunAgm-; 2 = n+m = 4), J. Chem. Phys., 2001, 115, 8, 3657-3663, https://doi.org/10.1063/1.1388036 . [all data]