bis(triethyltin) oxide
- Formula: C12H30OSn2
- Molecular weight: 427.786
- CAS Registry Number: 1112-63-6

Condensed phase thermochemistry data

Data compiled by: José A. Martinho Simões
Quantity | Value | Units | Method | Reference | Comment |
---|---|---|---|---|---|
ΔfH°liquid | -100.5 ± 3.0 | kcal/mol | Review | Martinho Simões | |
Quantity | Value | Units | Method | Reference | Comment |
ΔcH°liquid | -2328.9 ± 3.0 | kcal/mol | CC-SB | Rabinovich, Kiparisov, et al., 1971 | Please also see Pedley and Rylance, 1977. |

Phase change data

Data compiled as indicated in comments:
BS - Robert L. Brown and Stephen E. Stein
MS - José A. Martinho Simões
Quantity | Value | Units | Method | Reference | Comment |
---|---|---|---|---|---|
Tboil | 545. | K | N/A | Buckingham and Donaghy, 1982 | BS |
Quantity | Value | Units | Method | Reference | Comment |
ΔvapH° | 12.5 ± 0.50 | kcal/mol | CC-SB | Rabinovich, Kiparisov, et al., 1971 | MS |
Reduced pressure boiling point
Tboil (K) | Pressure (atm) | Reference | Comment |
---|---|---|---|
398. | 0.005 | Buckingham and Donaghy, 1982 | BS |

Gas phase thermochemistry data

Data compiled by: José A. Martinho Simões

Quantity Value Units Method Reference Comment
Δfgas-88.0 ± 3.1kcal/molReviewMartinho Simões

References

Martinho Simões
Martinho Simões, J.A.,
Private communication (see http://webbook.nist.gov/chemistry/om/). [all data]
Rabinovich, Kiparisov, et al., 1971
Rabinovich, I.B.; Kiparisov, E.G.; Aleksandrov, Y.A.,
Dokl. Akad. Nauk SSSR, 1971, 200, 5, 1116. [all data]
Pedley and Rylance, 1977
Pedley, J.B.; Rylance, J.,
Computer Analysed Thermochemical Data: Organic and Organometallic Compounds, University of Sussex, Brigton, 1977. [all data]
Buckingham and Donaghy, 1982
Buckingham, J.; Donaghy, S.M.,
Dictionary of Organic Compounds: Fifth Edition, Chapman and Hall, New York, 1982, 1. [all data]