bromo(2H3)methane
- Formula: CD3Br
- Molecular weight: 97.957
- IUPAC Standard InChIKey: GZUXJHMPEANEGY-FIBGUPNXSA-N
- CAS Registry Number: 1111-88-2
- Chemical structure:
View 3d structure (requires JavaScript / HTML 5) - Isotopologues:
- Other names: Methylbromide-d3

Vibrational and/or electronic energy levels

Data compiled by: Takehiko Shimanouchi
Symmetry: C3ν Symmetry Number σ = 3
Sym. | No | Approximate | Selected Freq. | Infrared | Raman | Comments | ||||
---|---|---|---|---|---|---|---|---|---|---|
Species | type of mode | Value | Rating | Value | Phase | Value | Phase | |||
a1 | 1 | CD3 s-str | 2160 | A | 2159.8 VS | gas | ||||
a1 | 2 | CD3 s-deform | 992 | A | 992.0 VS | gas | ||||
a1 | 3 | CBr str | 577 | A | 576.7 S | gas | ||||
e | 4 | CD3 d-str | 2297 | A | 2297.3 M | gas | ||||
e | 5 | CD3 d-deform | 1056 | A | 1055.6 S | gas | ||||
e | 6 | CD3 rock | 713 | A | 713.0 M | gas | ||||
Source: Shimanouchi, 1972

References

Shimanouchi, 1972
Shimanouchi, T.,
Tables of Molecular Vibrational Frequencies Consolidated Volume I, National Bureau of Standards, 1972, 1-160. [all data]