Heptanedioic acid
- Formula: C7H12O4
- Molecular weight: 160.1678
- IUPAC Standard InChIKey: WLJVNTCWHIRURA-UHFFFAOYSA-N
- CAS Registry Number: 111-16-0
- Chemical structure:
View 3d structure (requires JavaScript / HTML 5) - Other names: Pimelic acid; Pileric acid; 1,5-Pentanedicarboxylic acid; 1,7-Heptanedioic acid; Pentane-1,5-dicarboxylic acid; Heptandioic acid; Heptane-1,7-dioic acid

Condensed phase thermochemistry data

Data compiled by: Hussein Y. Afeefy, Joel F. Liebman, and Stephen E. Stein
Quantity | Value | Units | Method | Reference | Comment |
---|---|---|---|---|---|
ΔcH°solid | -3460.2 ± 1.0 | kJ/mol | Ccb | Verkade, Hartman, et al., 1926 | Reanalyzed by Cox and Pilcher, 1970, Original value = -3463. kJ/mol; See Verkade, Hartman, et al., 1924; Corresponding ΔfHºsolid = -1009.4 kJ/mol (simple calculation by NIST; no Washburn corrections) |

Phase change data

Data compiled as indicated in comments:
BS - Robert L. Brown and Stephen E. Stein
TRC - Thermodynamics Research Center, NIST Boulder Laboratories, Chris Muzny director
AC - William E. Acree, Jr., James S. Chickos
DH - Eugene S. Domalski and Elizabeth D. Hearing
Quantity | Value | Units | Method | Reference | Comment |
---|---|---|---|---|---|
Tfus | 377.5 | K | N/A | Berchiesi, 1981 | Uncertainty assigned by TRC = 0.4 K; TRC |
Tfus | 377.5 | K | N/A | Gioia Lobbia, 1981 | Uncertainty assigned by TRC = 0.3 K; TRC |
Tfus | 378. | K | N/A | Khetarpal, Lal, et al., 1980 | Uncertainty assigned by TRC = 1.5 K; TRC |
Tfus | 377.5 | K | N/A | Cingolani and Berchiesi, 1974 | Crystal phase 1 phase; Uncertainty assigned by TRC = 0.5 K; TRC |
Quantity | Value | Units | Method | Reference | Comment |
ΔvapH° | 112.0 ± 0.8 | kJ/mol | CGC | Roux, Temprado, et al., 2005 | Based on data from 424. to 503. K.; AC |
Quantity | Value | Units | Method | Reference | Comment |
ΔsubH° | 139.9 ± 1.0 | kJ/mol | N/A | Ribeiro da Silva, Monte, et al., 1999 | AC |
Reduced pressure boiling point
Tboil (K) | Pressure (bar) | Reference | Comment |
---|---|---|---|
485.2 | 0.013 | Aldrich Chemical Company Inc., 1990 | BS |
Enthalpy of vaporization
ΔvapH (kJ/mol) | Temperature (K) | Method | Reference | Comment |
---|---|---|---|---|
88.6 | 451. | A | Stephenson and Malanowski, 1987 | Based on data from 436. to 615. K. See also Stull, 1947.; AC |
Antoine Equation Parameters
log10(P) = A − (B / (T + C))
P = vapor pressure (bar)
T = temperature (K)
View plot Requires a JavaScript / HTML 5 canvas capable browser.
Temperature (K) | A | B | C | Reference | Comment |
---|---|---|---|---|---|
436.6 to 615.3 | 6.67432 | 3943.314 | -23.802 | Stull, 1947 | Coefficents calculated by NIST from author's data. |
Enthalpy of sublimation
ΔsubH (kJ/mol) | Temperature (K) | Method | Reference | Comment |
---|---|---|---|---|
153. ± 4. | 328. to 363. | TPD | Cappa, Lovejoy, et al., 2007 | AC |
124. | 283. to 300. | TPTD | Chattopadhyay and Ziemann, 2005 | AC |
80.8 | 318. to 336. | TPTD | Chattopadhyay and Ziemann, 2005 | AC |
178. | 288. to 308. | TPTD | Chattopadhyay, Tobias, et al., 2001 | Values based on the TPTD method are not consistent with values determined by other experimental methods; AC |
Enthalpy of fusion
ΔfusH (kJ/mol) | Temperature (K) | Reference | Comment |
---|---|---|---|
23.7 | 368.2 | Roux, Temprado, et al., 2005 | AC |
27.62 | 377.5 | Acree, 1993 | AC |
Enthalpy of phase transition
ΔHtrs (kJ/mol) | Temperature (K) | Initial Phase | Final Phase | Reference | Comment |
---|---|---|---|---|---|
1.000 | 369.7 | crystaline, II | crystaline, I | Petropavlov, Tsygankova, et al., 1988 | DH |
1.322 | 369.0 | crystaline, II | crystaline, I | Cingolani and Berchiesi, 1974 | DH |
27.623 | 377.5 | crystaline, I | liquid | Cingolani and Berchiesi, 1974 | DH |
Entropy of phase transition
ΔStrs (J/mol*K) | Temperature (K) | Initial Phase | Final Phase | Reference | Comment |
---|---|---|---|---|---|
2.7 | 369.7 | crystaline, II | crystaline, I | Petropavlov, Tsygankova, et al., 1988 | DH |
3.60 | 369.0 | crystaline, II | crystaline, I | Cingolani and Berchiesi, 1974 | DH |
73.18 | 377.5 | crystaline, I | liquid | Cingolani and Berchiesi, 1974 | DH |

Reaction thermochemistry data

Data compiled by: John E. Bartmess
Individual Reactions
C7H11O4- + =
By formula: C7H11O4- + H+ = C7H12O4
Quantity | Value | Units | Method | Reference | Comment |
---|---|---|---|---|---|
ΔrH° | 1358. ± 8.4 | kJ/mol | CIDC | Kumar, Prabhakar, et al., 2005 | gas phase |
Quantity | Value | Units | Method | Reference | Comment |
ΔrG° | 1351. ± 8.4 | kJ/mol | CIDC | Kumar, Prabhakar, et al., 2005 | gas phase |

Gas phase ion energetics data

Data compiled by: John E. Bartmess
De-protonation reactions
C7H11O4- + =
By formula: C7H11O4- + H+ = C7H12O4
Quantity | Value | Units | Method | Reference | Comment |
---|---|---|---|---|---|
ΔrH° | 1358. ± 8.4 | kJ/mol | CIDC | Kumar, Prabhakar, et al., 2005 | gas phase |
Quantity | Value | Units | Method | Reference | Comment |
ΔrG° | 1351. ± 8.4 | kJ/mol | CIDC | Kumar, Prabhakar, et al., 2005 | gas phase |

References

Verkade, Hartman, et al., 1926
Verkade, P.E.; Hartman, H.; Coops, J.,
Calorimetric researches. X. Heats of combustion of successive terms of homologous series: dicarboxylic acids of the oxalic acid series,
Rec. Trav. Chim. Pays/Bas, 1926, 45, 373-393. [all data]
Cox and Pilcher, 1970
Cox, J.D.; Pilcher, G.,
Thermochemistry of Organic and Organometallic Compounds, Academic Press, New York, 1970, 1-636. [all data]
Verkade, Hartman, et al., 1924
Verkade, P.E.; Hartman, H.; Coops, J., Jr.,
Chemistry - The molecular heat of combustion of successive terms of homologous series,
Kom. Med. Akad. Ueknschap. Proc., 1924, 27, 859-866. [all data]
Berchiesi, 1981
Berchiesi, M.A.,
Int. DATA Ser., Sel. Data Mixtures, Ser. A, 1981, No. 2, 123. [all data]
Gioia Lobbia, 1981
Gioia Lobbia, G.,
Int. DATA Ser., Sel. Data Mixtures, Ser. A, 1981, No. 1, 46. [all data]
Khetarpal, Lal, et al., 1980
Khetarpal, S.C.; Lal, K.; Bhatnagar, H.I.,
Indian J. Chem., Sect. A:Inorg., Phys., Theor. Anal., 1980, 19A, 516. [all data]
Cingolani and Berchiesi, 1974
Cingolani, A.; Berchiesi, G.,
Thermodynamic properties of organic compounds. 1. A DSC study of phase transitions in aliphatic dicarboxylic acids,
J. Therm. Anal., 1974, 6, 87-90. [all data]
Roux, Temprado, et al., 2005
Roux, Maria Victoria; Temprado, Manuel; Chickos, James S.,
Vaporization, fusion and sublimation enthalpies of the dicarboxylic acids from C4 to C14 and C16,
The Journal of Chemical Thermodynamics, 2005, 37, 9, 941-953, https://doi.org/10.1016/j.jct.2004.12.011
. [all data]
Ribeiro da Silva, Monte, et al., 1999
Ribeiro da Silva, Manuel A.V.; Monte, Manuel J.S.; Ribeiro, José R.,
Vapour pressures and the enthalpies and entropies of sublimation of five dicarboxylic acids,
The Journal of Chemical Thermodynamics, 1999, 31, 8, 1093-1107, https://doi.org/10.1006/jcht.1999.0522
. [all data]
Aldrich Chemical Company Inc., 1990
Aldrich Chemical Company Inc.,
Catalog Handbook of Fine Chemicals, Aldrich Chemical Company, Inc., Milwaukee WI, 1990, 1. [all data]
Stephenson and Malanowski, 1987
Stephenson, Richard M.; Malanowski, Stanislaw,
Handbook of the Thermodynamics of Organic Compounds, 1987, https://doi.org/10.1007/978-94-009-3173-2
. [all data]
Stull, 1947
Stull, Daniel R.,
Vapor Pressure of Pure Substances. Organic and Inorganic Compounds,
Ind. Eng. Chem., 1947, 39, 4, 517-540, https://doi.org/10.1021/ie50448a022
. [all data]
Cappa, Lovejoy, et al., 2007
Cappa, Christopher D.; Lovejoy, Edward R.; Ravishankara, A.R.,
Determination of Evaporation Rates and Vapor Pressures of Very Low Volatility Compounds: A Study of the C 4 -C 10 and C 12 Dicarboxylic Acids,
J. Phys. Chem. A, 2007, 111, 16, 3099-3109, https://doi.org/10.1021/jp068686q
. [all data]
Chattopadhyay and Ziemann, 2005
Chattopadhyay, Sulekha; Ziemann, Paul J.,
Vapor Pressures of Substituted and Unsubstituted Monocarboxylic and Dicarboxylic Acids Measured Using an Improved Thermal Desorption Particle Beam Mass Spectrometry Method,
Aerosol Science and Technology, 2005, 39, 11, 1085-1100, https://doi.org/10.1080/02786820500421547
. [all data]
Chattopadhyay, Tobias, et al., 2001
Chattopadhyay, Sulekha; Tobias, Herbert J.; Ziemann, Paul J.,
A Method for Measuring Vapor Pressures of Low-Volatility Organic Aerosol Compounds Using a Thermal Desorption Particle Beam Mass Spectrometer,
Anal. Chem., 2001, 73, 16, 3797-3803, https://doi.org/10.1021/ac010304j
. [all data]
Acree, 1993
Acree, William E.,
Thermodynamic properties of organic compounds,
Thermochimica Acta, 1993, 219, 97-104, https://doi.org/10.1016/0040-6031(93)80486-T
. [all data]
Petropavlov, Tsygankova, et al., 1988
Petropavlov, N.N.; Tsygankova, I.G.; Teslenko, L.A.,
Microcalorimetric investigation of polymorphic transitions in organic crystals,
Sov. Phys. Crystallogr., 1988, 33(6), 853-855. [all data]
Kumar, Prabhakar, et al., 2005
Kumar, M.R.; Prabhakar, S.; Nagaveni, V.; Vairamani, M.,
Estimation of gas-phase acidities of a series of dicarboxylic acids by the kinetic method,
Rapid Commun. Mass Spectrom., 2005, 19, 8, 1053-1057, https://doi.org/10.1002/rcm.1888
. [all data]