Diisopropanolamine
- Formula: C6H15NO2
- Molecular weight: 133.1888
- IUPAC Standard InChIKey: LVTYICIALWPMFW-UHFFFAOYSA-N
- CAS Registry Number: 110-97-4
- Chemical structure:
View 3d structure (requires JavaScript / HTML 5) - Species with the same structure:
- Other names: 2-Propanol, 1,1'-iminobis-; 2-Propanol, 1,1'-iminodi-; Bis(2-hydroxypropyl)amine; Bis(2-propanol)amine; 1,1'-Iminobis[2-propanol]; 1,1'-Iminodi-2-propanol; 1,1'-iminodipropan-2-ol; DIPA; Di(2-hydroxy-n-propyl) amine; Dipropyl-2,2'-dihydroxy-amine; Di-2-propanolamine; DIPA (alcohol); N,N-Bis(2-hydroxypropyl)amine; NSC 4963

Phase change data

Data compiled as indicated in comments:
BS - Robert L. Brown and Stephen E. Stein
AC - William E. Acree, Jr., James S. Chickos
Reduced pressure boiling point
Tboil (K) | Pressure (bar) | Reference | Comment |
---|---|---|---|
522.7 | 0.993 | Weast and Grasselli, 1989 | BS |
Enthalpy of vaporization
ΔvapH (kJ/mol) | Temperature (K) | Method | Reference | Comment |
---|---|---|---|---|
68.0 | 405. | A | Stephenson and Malanowski, 1987 | Based on data from 390. to 521. K. See also Dykyj, 1972.; AC |

References

Weast and Grasselli, 1989
CRC Handbook of Data on Organic Compounds, 2nd Editon, Weast,R.C and Grasselli, J.G., ed(s)., CRC Press, Inc., Boca Raton, FL, 1989, 1. [all data]
Stephenson and Malanowski, 1987
Stephenson, Richard M.; Malanowski, Stanislaw,
Handbook of the Thermodynamics of Organic Compounds, 1987, https://doi.org/10.1007/978-94-009-3173-2
. [all data]
Dykyj, 1972
Dykyj, J.,
Petrochemia, 1972, 12, 1, 13. [all data]