Pentanedioic acid
- Formula: C5H8O4
- Molecular weight: 132.1146
- IUPAC Standard InChIKey: JFCQEDHGNNZCLN-UHFFFAOYSA-N
- CAS Registry Number: 110-94-1
- Chemical structure:
View 3d structure (requires JavaScript / HTML 5) - Other names: Glutaric acid; 1,3-Propanedicarboxylic acid; 1,5-Pentanedioic acid; Pentandioic acid

Condensed phase thermochemistry data

Data compiled by: Hussein Y. Afeefy, Joel F. Liebman, and Stephen E. Stein
Quantity | Value | Units | Method | Reference | Comment |
---|---|---|---|---|---|
ΔfH°solid | -960.5 ± 1.1 | kJ/mol | Ccb | El-Sayed, 1993 | |
ΔfH°solid | -960.0 ± 1.2 | kJ/mol | Ccb | Wilhoit and Shiao, 1964 | |
Quantity | Value | Units | Method | Reference | Comment |
ΔcH°solid | -2150.35 ± 0.75 | kJ/mol | Ccb | El-Sayed, 1993 | Corresponding ΔfHºsolid = -960.52 kJ/mol (simple calculation by NIST; no Washburn corrections) |
ΔcH°solid | -2150.9 ± 1.2 | kJ/mol | Ccb | Wilhoit and Shiao, 1964 | Corresponding ΔfHºsolid = -959.98 kJ/mol (simple calculation by NIST; no Washburn corrections) |
ΔcH°solid | -2151.6 ± 0.50 | kJ/mol | Ccb | Verkade, Hartman, et al., 1926 | Reanalyzed by Cox and Pilcher, 1970, Original value = -2154. kJ/mol; See Verkade, Hartman, et al., 1924; Corresponding ΔfHºsolid = -959.31 kJ/mol (simple calculation by NIST; no Washburn corrections) |

Gas phase ion energetics data

Data compiled by: John E. Bartmess
De-protonation reactions
C5H7O4- + =
By formula: C5H7O4- + H+ = C5H8O4
Quantity | Value | Units | Method | Reference | Comment |
---|---|---|---|---|---|
ΔrH° | 1367. ± 8.4 | kJ/mol | CIDC | Kumar, Prabhakar, et al., 2005 | gas phase |
Quantity | Value | Units | Method | Reference | Comment |
ΔrG° | 1338. ± 8.4 | kJ/mol | CIDC | Kumar, Prabhakar, et al., 2005 | gas phase |

Phase change data

Data compiled as indicated in comments:
BS - Robert L. Brown and Stephen E. Stein
TRC - Thermodynamics Research Center, NIST Boulder Laboratories, Chris Muzny director
AC - William E. Acree, Jr., James S. Chickos
DH - Eugene S. Domalski and Elizabeth D. Hearing
Quantity | Value | Units | Method | Reference | Comment |
---|---|---|---|---|---|
Tfus | 370.7 ± 0.9 | K | AVG | N/A | Average of 9 values; Individual data points |
Quantity | Value | Units | Method | Reference | Comment |
ΔvapH° | 24.28 | kcal/mol | GS | Roux, Temprado, et al., 2005 | Based on data from 424. to 503. K.; AC |
Quantity | Value | Units | Method | Reference | Comment |
ΔsubH° | 28.63 ± 0.29 | kcal/mol | ME | Ribeiro da Silva, Monte, et al., 1999 | Based on data from 348. to 363. K.; AC |
Reduced pressure boiling point
Tboil (K) | Pressure (atm) | Reference | Comment |
---|---|---|---|
473.2 | 0.026 | Aldrich Chemical Company Inc., 1990 | BS |
Enthalpy of vaporization
ΔvapH (kcal/mol) | Temperature (K) | Method | Reference | Comment |
---|---|---|---|---|
23.4 | 443. | A | Stephenson and Malanowski, 1987 | Based on data from 428. to 576. K. See also Stull, 1947.; AC |
Antoine Equation Parameters
log10(P) = A − (B / (T + C))
P = vapor pressure (atm)
T = temperature (K)
View plot Requires a JavaScript / HTML 5 canvas capable browser.
Temperature (K) | A | B | C | Reference | Comment |
---|---|---|---|---|---|
428.7 to 576. | 7.67402 | 4140.732 | -36.41 | Stull, 1947 | Coefficents calculated by NIST from author's data. |
Enthalpy of sublimation
ΔsubH (kcal/mol) | Temperature (K) | Method | Reference | Comment |
---|---|---|---|---|
32.0 ± 1. | 313. to 349. | TPD | Cappa, Lovejoy, et al., 2007 | AC |
31.62 | 275. to 294. | TPTD | Chattopadhyay and Ziemann, 2005 | Values based on TPTD method are not consistent with values determined by other experimental methods; AC |
27.96 ± 0.29 | 356. | ME | Ribeiro da Silva, Monte, et al., 1999 | Based on data from 348. to 363. K.; AC |
Enthalpy of fusion
ΔfusH (kcal/mol) | Temperature (K) | Method | Reference | Comment |
---|---|---|---|---|
4.95 | 370.9 | DSC | Good and Rodriguez-Hornedo, 2009 | AC |
5.09 | 372.3 | DSC | Ha, Hamilton, et al., 2009 | AC |
4.49 | 363.9 | DSC | Roux, Temprado, et al., 2005 | AC |
5.5 | 371. | N/A | Steele, Chirico, et al., 2002 | AC |
5.00 | 371. | N/A | Acree, 1991 | AC |
Enthalpy of phase transition
ΔHtrs (kcal/mol) | Temperature (K) | Initial Phase | Final Phase | Reference | Comment |
---|---|---|---|---|---|
0.5736 | 338.0 | crystaline, II | crystaline, I | Petropavlov, Tsygankova, et al., 1988 | DH |
0.5889 | 348.5 | crystaline, II | crystaline, I | Cingolani and Berchiesi, 1974 | DH |
4.9950 | 371.0 | crystaline, I | liquid | Cingolani and Berchiesi, 1974 | DH |
Entropy of phase transition
ΔStrs (cal/mol*K) | Temperature (K) | Initial Phase | Final Phase | Reference | Comment |
---|---|---|---|---|---|
1.7 | 338.0 | crystaline, II | crystaline, I | Petropavlov, Tsygankova, et al., 1988 | DH |
1.69 | 348.5 | crystaline, II | crystaline, I | Cingolani and Berchiesi, 1974 | DH |
13.46 | 371.0 | crystaline, I | liquid | Cingolani and Berchiesi, 1974 | DH |

Reaction thermochemistry data

Data compiled by: John E. Bartmess
Individual Reactions
C5H7O4- + =
By formula: C5H7O4- + H+ = C5H8O4
Quantity | Value | Units | Method | Reference | Comment |
---|---|---|---|---|---|
ΔrH° | 326.7 ± 2.0 | kcal/mol | CIDC | Kumar, Prabhakar, et al., 2005 | gas phase |
Quantity | Value | Units | Method | Reference | Comment |
ΔrG° | 319.7 ± 2.0 | kcal/mol | CIDC | Kumar, Prabhakar, et al., 2005 | gas phase |

Henry's Law data

Data compiled by: Rolf Sander
Henry's Law constant (water solution)
kH(T) = k°H exp(d(ln(kH))/d(1/T) ((1/T) - 1/(298.15 K)))
k°H = Henry's law constant for solubility in water at 298.15 K (mol/(kg*bar))
d(ln(kH))/d(1/T) = Temperature dependence constant (K)
k°H (mol/(kg*bar)) | d(ln(kH))/d(1/T) (K) | Method | Reference | Comment |
---|---|---|---|---|
2.0×10+8 | E | N/A | Value obtained by missing citation using the group contribution method. |

References

El-Sayed, 1993
El-Sayed, N.I.,
The enthalpy of combustion and formation of hydantoin,
Asian J. Chem., 1993, 5, 199-207. [all data]
Wilhoit and Shiao, 1964
Wilhoit, R.C.; Shiao, D.,
Thermochemistry of biologically important compounds. Heats of combustion of solid organic acids.,
J. Chem. Eng. Data, 1964, 9, 595-599. [all data]
Verkade, Hartman, et al., 1926
Verkade, P.E.; Hartman, H.; Coops, J.,
Calorimetric researches. X. Heats of combustion of successive terms of homologous series: dicarboxylic acids of the oxalic acid series,
Rec. Trav. Chim. Pays/Bas, 1926, 45, 373-393. [all data]
Cox and Pilcher, 1970
Cox, J.D.; Pilcher, G.,
Thermochemistry of Organic and Organometallic Compounds, Academic Press, New York, 1970, 1-636. [all data]
Verkade, Hartman, et al., 1924
Verkade, P.E.; Hartman, H.; Coops, J., Jr.,
Chemistry - The molecular heat of combustion of successive terms of homologous series,
Kom. Med. Akad. Ueknschap. Proc., 1924, 27, 859-866. [all data]
Kumar, Prabhakar, et al., 2005
Kumar, M.R.; Prabhakar, S.; Nagaveni, V.; Vairamani, M.,
Estimation of gas-phase acidities of a series of dicarboxylic acids by the kinetic method,
Rapid Commun. Mass Spectrom., 2005, 19, 8, 1053-1057, https://doi.org/10.1002/rcm.1888
. [all data]