bis(cyclopentadienyl)gadolinium chloride
- Formula: C10H10ClGd
- Molecular weight: 322.89
- CAS Registry Number: 11087-14-2

Phase change data

Data compiled by: William E. Acree, Jr., James S. Chickos
Enthalpy of sublimation
ΔsubH (kcal/mol) | Temperature (K) | Method | Reference | Comment |
---|---|---|---|---|
33.10 ± 0.50 | 338. to 438. | ME | Haug, 1971 | |
27.70 ± 0.50 | 338. to 348. | ME | Haug, 1971 | See also Haug, 1971, 2. |

References

Haug, 1971
Haug, H.O.,
Ges. Kernforsch m.b.H. [Rep.] KFK-1283, 1971, 23. [all data]
Haug, 1971, 2
Haug, H.O.,
Dampfdruckmessungen von cyclopentadienylkomplexen des urans und einiger lanthaniden nach der effusionsmethode,
Journal of Organometallic Chemistry, 1971, 30, 1, 53-57, https://doi.org/10.1016/S0022-328X(00)82595-4
. [all data]