CAS Reg. No. 11080-58-3
- CAS Registry Number: 11080-58-3

Reaction thermochemistry data

Data compiled by: John E. Bartmess
Individual Reactions
(CAS Reg. No. 11080-58-3 • 4294967295) +
= CAS Reg. No. 11080-58-3
By formula: (CAS Reg. No. 11080-58-3 • 4294967295Si) + Si = CAS Reg. No. 11080-58-3
Quantity | Value | Units | Method | Reference | Comment |
---|---|---|---|---|---|
ΔrH° | 72.8 ± 3.3 | kcal/mol | N/A | Kawamata, Neigishi, et al., 1996 | gas phase; Vertical Detachment Energy: 0.81±0.05 eV. |

References

Kawamata, Neigishi, et al., 1996
Kawamata, H.; Neigishi, Y.; Kishi, R.; Iwata, S.; Nakajima, A.; Kaya, K.,
Photoelectron Spectroscopy of Silicon-Fluorine Binary Cluster Anions (SinFm-),
J. Chem. Phys., 1996, 105, 13, 5369, https://doi.org/10.1063/1.472377
. [all data]