Ethanol, 2-(ethylthio)-
- Formula: C4H10OS
- Molecular weight: 106.187
- IUPAC Standard InChIKey: LNRIEBFNWGMXKP-UHFFFAOYSA-N
- CAS Registry Number: 110-77-0
- Chemical structure:
View 3d structure (requires JavaScript / HTML 5) - Other names: 2-(Ethylthio)ethanol; β-Ethylthioethanol; β-Hydroxydiethyl sulfide; Ethyl β-hydroxyethyl sulfide; Ethyl 2-hydroxyethyl sulfide; Ethyl 2-hydroxyethyl thioether; 2-Hydroxyethyl ethyl sulfide; Ethyl thioethanol; β-ethylmerkaptoethanol; NSC 57105

Phase change data

Data compiled by: Robert L. Brown and Stephen E. Stein
Quantity | Value | Units | Method | Reference | Comment |
---|---|---|---|---|---|
Tboil | 455.2 | K | N/A | Aldrich Chemical Company Inc., 1990 | |
Tboil | 457.2 | K | N/A | Weast and Grasselli, 1989 | |
Tboil | 453. to 456. | K | N/A | Frinton Laboratories Inc., 1986 |

References

Aldrich Chemical Company Inc., 1990
Aldrich Chemical Company Inc.,
Catalog Handbook of Fine Chemicals, Aldrich Chemical Company, Inc., Milwaukee WI, 1990, 1. [all data]
Weast and Grasselli, 1989
CRC Handbook of Data on Organic Compounds, 2nd Editon, Weast,R.C and Grasselli, J.G., ed(s)., CRC Press, Inc., Boca Raton, FL, 1989, 1. [all data]
Frinton Laboratories Inc., 1986
Frinton Laboratories Inc.,
Catalog Number 11, Frinton Laboratories Inc., Vineland, NJ, 1986, 99. [all data]