Hafnium anion

Gas phase thermochemistry data

Quantity Value Units Method Reference Comment
gas,1 bar185.04J/mol*KReviewChase, 1998Data last reviewed in March, 1984

References

Chase, 1998
Chase, M.W., Jr., NIST-JANAF Themochemical Tables, Fourth Edition, J. Phys. Chem. Ref. Data, Monograph 9, 1998, 1-1951. [all data]