1-Pentanethiol
- Formula: C5H12S
- Molecular weight: 104.214
- IUPAC Standard InChIKey: ZRKMQKLGEQPLNS-UHFFFAOYSA-N
- CAS Registry Number: 110-66-7
- Chemical structure:
View 3d structure (requires JavaScript / HTML 5) - Other names: n-Amyl mercaptan; n-Pentyl mercaptan; Amyl hydrosulfide; Amyl mercaptan; Amyl sulfhydrate; Amyl thioalcohol; Pentane-1-thiol; Pentanethiol; Pentyl mercaptan; 1-Mercaptopentane; CH3(CH2)4SH; Mercaptan amylique; Pentalarm; 1-Pentanthiol; 1-Pentylthiol

Gas phase thermochemistry data

Data compiled as indicated in comments:
DRB - Donald R. Burgess, Jr.
ALS - Hussein Y. Afeefy, Joel F. Liebman, and Stephen E. Stein
Quantity | Value | Units | Method | Reference | Comment |
---|---|---|---|---|---|
ΔfH°gas | -109.7 | kJ/mol | N/A | Sunner, 1963 | Value computed using ΔfHliquid° value of -150.9±0.8 kj/mol from Sunner, 1963 and ΔvapH° value of 41.2 kj/mol from Hubbard, Katz, et al., 1954.; DRB |
ΔfH°gas | -110.8 ± 1.8 | kJ/mol | Ccr | Hubbard, Katz, et al., 1954 | Heat of combustion calculated author's U=-985.05; ALS |

Condensed phase thermochemistry data

Data compiled as indicated in comments:
ALS - Hussein Y. Afeefy, Joel F. Liebman, and Stephen E. Stein
DH - Eugene S. Domalski and Elizabeth D. Hearing
Quantity | Value | Units | Method | Reference | Comment |
---|---|---|---|---|---|
ΔfH°liquid | -150.9 ± 0.84 | kJ/mol | Ccr | Sunner, 1963 | correction of Sunner, 1955; ALS |
ΔfH°liquid | -152.0 ± 1.7 | kJ/mol | Ccr | Hubbard, Katz, et al., 1954 | Heat of combustion calculated author's U=-985.05; ALS |
Quantity | Value | Units | Method | Reference | Comment |
ΔcH°liquid | -4133.8 | kJ/mol | Ccr | Sunner, 1963 | correction of Sunner, 1955; ALS |
ΔcH°liquid | -4132.6 ± 1.5 | kJ/mol | Ccr | Hubbard, Katz, et al., 1954 | Heat of combustion calculated author's U=-985.05; ALS |
ΔcH°liquid | -4151. | kJ/mol | Ccb | Berthelot, 1901 | ALS |
Quantity | Value | Units | Method | Reference | Comment |
S°liquid | 310.37 | J/mol*K | N/A | Finke, Scott, et al., 1952 | DH |
Constant pressure heat capacity of liquid
Cp,liquid (J/mol*K) | Temperature (K) | Reference | Comment |
---|---|---|---|
201.17 | 296.21 | Finke, Scott, et al., 1952 | T = 12 to 320 K. Value is unsmoothed experimental datum.; DH |

Phase change data

Data compiled as indicated in comments:
BS - Robert L. Brown and Stephen E. Stein
TRC - Thermodynamics Research Center, NIST Boulder Laboratories, Chris Muzny director
AC - William E. Acree, Jr., James S. Chickos
ALS - Hussein Y. Afeefy, Joel F. Liebman, and Stephen E. Stein
DRB - Donald R. Burgess, Jr.
DH - Eugene S. Domalski and Elizabeth D. Hearing
Quantity | Value | Units | Method | Reference | Comment |
---|---|---|---|---|---|
Tboil | 399.2 | K | N/A | Aldrich Chemical Company Inc., 1990 | BS |
Tboil | 399. | K | N/A | American Tokyo Kasei, 1988 | BS |
Tboil | 399.8 | K | N/A | Majer and Svoboda, 1985 | |
Tboil | 397. | K | N/A | Cossar, Fournier, et al., 1962 | Uncertainty assigned by TRC = 2.5 K; TRC |
Tboil | 398. | K | N/A | Mann and Purdie, 1935 | Uncertainty assigned by TRC = 1. K; TRC |
Quantity | Value | Units | Method | Reference | Comment |
Tfus | 197.5 | K | N/A | Teets, 1934 | Uncertainty assigned by TRC = 0.5 K; TRC |
Tfus | 197.5 | K | N/A | Ellis and Reid, 1932 | Uncertainty assigned by TRC = 0.3 K; TRC |
Quantity | Value | Units | Method | Reference | Comment |
Ttriple | 197.45 | K | N/A | Finke, McCullough, et al., 1970 | Uncertainty assigned by TRC = 0.02 K; TRC |
Ttriple | 197.46 | K | N/A | Finke, Scott, et al., 1952, 2 | Uncertainty assigned by TRC = 0.02 K; TRC |
Quantity | Value | Units | Method | Reference | Comment |
Tc | 597.7 | K | N/A | Majer and Svoboda, 1985 | |
Quantity | Value | Units | Method | Reference | Comment |
ΔvapH° | 41.26 | kJ/mol | N/A | Majer and Svoboda, 1985 | |
ΔvapH° | 41.1 | kJ/mol | N/A | Reid, 1972 | AC |
ΔvapH° | 41.1 | kJ/mol | V | Finke, Hossenlopp, et al., 1965 | vapor flow calorimetry; ALS |
ΔvapH° | 41.2 | kJ/mol | N/A | Hubbard, Katz, et al., 1954 | DRB |
Enthalpy of vaporization
ΔvapH (kJ/mol) | Temperature (K) | Method | Reference | Comment |
---|---|---|---|---|
34.88 | 399.8 | N/A | Majer and Svoboda, 1985 | |
40.6 | 315. | N/A | Dykyj, Svoboda, et al., 1999 | Based on data from 300. to 426. K.; AC |
38.1 | 362. | A,EB | Stephenson and Malanowski, 1987 | Based on data from 347. to 440. K. See also Finke, Scott, et al., 1952 and Osborn and Douslin, 1966.; AC |
37.1 ± 0.1 | 356. | C | Finke, Hossenlopp, et al., 1965, 2 | AC |
36.4 ± 0.1 | 376. | C | Finke, Hossenlopp, et al., 1965, 2 | AC |
34.9 ± 0.1 | 400. | C | Finke, Hossenlopp, et al., 1965, 2 | AC |
Enthalpy of vaporization
ΔvapH =
A exp(-βTr) (1 − Tr)β
ΔvapH =
Enthalpy of vaporization (at saturation pressure)
(kJ/mol)
Tr = reduced temperature (T / Tc)
View plot Requires a JavaScript / HTML 5 canvas capable browser.
Temperature (K) | A (kJ/mol) | β | Tc (K) | Reference | Comment |
---|---|---|---|---|---|
356. to 400. | 57.97 | 0.2863 | 597.7 | Majer and Svoboda, 1985 |
Antoine Equation Parameters
log10(P) = A − (B / (T + C))
P = vapor pressure (bar)
T = temperature (K)
View plot Requires a JavaScript / HTML 5 canvas capable browser.
Temperature (K) | A | B | C | Reference |
---|---|---|---|---|
349.62 to 439.46 | 4.05801 | 1369.479 | -61.836 | Osborn and Douslin, 1966 |
Enthalpy of fusion
ΔfusH (kJ/mol) | Temperature (K) | Reference | Comment |
---|---|---|---|
17.531 | 197.46 | Finke, Scott, et al., 1952 | DH |
17.53 | 197.5 | Domalski and Hearing, 1996 | AC |
Entropy of fusion
ΔfusS (J/mol*K) | Temperature (K) | Reference | Comment |
---|---|---|---|
88.78 | 197.46 | Finke, Scott, et al., 1952 | DH |

Reaction thermochemistry data

Data compiled as indicated in comments:
B - John E. Bartmess
ALS - Hussein Y. Afeefy, Joel F. Liebman, and Stephen E. Stein
Individual Reactions
C5H11S- + =
By formula: C5H11S- + H+ = C5H12S
Quantity | Value | Units | Method | Reference | Comment |
---|---|---|---|---|---|
ΔrH° | 1475. ± 10. | kJ/mol | D-EA | Janousek, Reed, et al., 1980 | gas phase; B |
Quantity | Value | Units | Method | Reference | Comment |
ΔrG° | 1449. ± 10. | kJ/mol | H-TS | Janousek, Reed, et al., 1980 | gas phase; B |
By formula: 2C5H12S + I2 = 2HI + C10H22S2
Quantity | Value | Units | Method | Reference | Comment |
---|---|---|---|---|---|
ΔrH° | -124.9 | kJ/mol | Cm | Sunner, 1955, 2 | liquid phase; solvent: Ethanol/water(90/10); ALS |

Gas phase ion energetics data

Data compiled by: John E. Bartmess
De-protonation reactions
C5H11S- + =
By formula: C5H11S- + H+ = C5H12S
Quantity | Value | Units | Method | Reference | Comment |
---|---|---|---|---|---|
ΔrH° | 1475. ± 10. | kJ/mol | D-EA | Janousek, Reed, et al., 1980 | gas phase |
Quantity | Value | Units | Method | Reference | Comment |
ΔrG° | 1449. ± 10. | kJ/mol | H-TS | Janousek, Reed, et al., 1980 | gas phase |

Kovats' RI, non-polar column, isothermal

View large format table.

Column type Active phase Temperature (C) I Reference Comment
CapillaryDB-5100.821.7Miller and Bruno, 200330. m/0.25 mm/0.1 μm
CapillaryDB-5120.828.8Miller and Bruno, 200330. m/0.25 mm/0.1 μm
CapillaryDB-560.814.0Miller and Bruno, 200330. m/0.25 mm/0.1 μm
CapillaryDB-580.817.0Miller and Bruno, 200330. m/0.25 mm/0.1 μm
PackedC78, Branched paraffin130.818.9Dallos, Sisak, et al., 2000He; Column length: 3.3 m
PackedC78, Branched paraffin130.821.1Reddy, Dutoit, et al., 1992Chromosorb G HP; Column length: 3.3 m
PackedApolane130.824.Dutoit, 1991Column length: 3.7 m
PackedApiezon M130.828.Garbuzov, Misharina, et al., 1985He or N2, Chromosorb W, AW-DMCS; Column length: 2.1 m
PackedApiezon M130.827.Golovnya and Garbuzov, 1974N2, Chromosorb W; Column length: 2.1 m

Kovats' RI, non-polar column, custom temperature program

View large format table.

Column type Active phase I Reference Comment
CapillaryApiezon M828.Zhu, Wang, et al., 2007Program: not specified

Kovats' RI, polar column, isothermal

View large format table.

Column type Active phase Temperature (C) I Reference Comment
CapillaryPEG-20M93.1052.9Morishita, Murakita, et al., 1985Column length: 50. m; Column diameter: 0.25 mm
CapillaryPEG-20M80.1047.9Morishita, Murakita, et al., 1982N2; Column length: 50. m; Column diameter: 0.25 mm
PackedCarbowax 20M110.1039.Möckel and Zolg, 1977He, Chromosorb W AW (80-100 mesh); Column length: 6. m

Kovats' RI, polar column, custom temperature program

View large format table.

Column type Active phase I Reference Comment
CapillaryPEG-20M1063.Zhu, Wang, et al., 2007Program: not specified

Van Den Dool and Kratz RI, non-polar column, temperature ramp

View large format table.

Column type Active phase I Reference Comment
CapillaryBPX-5816.Ames, Guy, et al., 200150. m/0.32 mm/0.5 μm, He, 60. C @ 5. min, 4. K/min, 250. C @ 10. min

Van Den Dool and Kratz RI, non-polar column, custom temperature program

View large format table.

Column type Active phase I Reference Comment
CapillaryDB-5826.Parker, Hassell, et al., 200050. m/0.32 mm/0.5 μm, He; Program: oC(5min) => 60C/min => 60C (5min) => 4C/min => 250C

Normal alkane RI, non-polar column, isothermal

View large format table.

Column type Active phase Temperature (C) I Reference Comment
CapillaryPolydimethyl siloxane with 5 % Ph groups100.822.Safa and Hadjmohannadi, 200530. m/0.25 mm/0.10 μm, Nitrogen
CapillaryPolydimethyl siloxane with 5 % Ph groups60.814.Safa and Hadjmohannadi, 200530. m/0.25 mm/0.10 μm, Nitrogen
CapillaryPolydimethyl siloxane with 5 % Ph groups80.817.Safa and Hadjmohannadi, 200530. m/0.25 mm/0.10 μm, Nitrogen
CapillaryDC-20050.803.Leppin, Gollnick, et al., 1969Argon; Column length: 100. m

Normal alkane RI, non-polar column, temperature ramp

View large format table.

Column type Active phase I Reference Comment
CapillaryDB-5822.Macku and Shibamoto, 1991He, 40. C @ 5. min, 2. K/min; Column length: 60. m; Column diameter: 0.25 mm; Tend: 160. C

Normal alkane RI, non-polar column, custom temperature program

View large format table.

Column type Active phase I Reference Comment
CapillaryCP Sil 5 CB819.Gijs, Piraprez, et al., 200050. m/0.32 mm/1.2 μm, He; Program: 33C (16.5min) => 2C/min => 160C => 20C/min => 200C (9min)
CapillaryPolydimethyl siloxanes822.Zenkevich, 1998Program: not specified
CapillaryOV-1, SE-30, Methyl silicone, SP-2100, OV-101, DB-1, etc.795.Waggott and Davies, 1984Hydrogen; Column length: 50. m; Column diameter: 0.32 mm; Program: not specified

References

Sunner, 1963
Sunner, S.,
Corrected heat of combustion and formation values for a number of organic sulphur compounds,
Acta Chem. Scand., 1963, 17, 728-730. [all data]
Hubbard, Katz, et al., 1954
Hubbard, W.N.; Katz, C.; Waddington, G.,
A rotating combustion bomb for precision calorimetry. Heats of combustion of some sulfur-containing compounds,
J. Phys. Chem., 1954, 58, 142. [all data]
Sunner, 1955
Sunner, S.,
Thermochemical investigation on organic sulfur compounds IV. On thermochemical sulfur bond energy terms,
Acta Chem. Scand., 1955, 9, 837-846. [all data]
Berthelot, 1901
Berthelot, M.,
Chimie Organique. - Nouvelles recherches sur l'isomerie des ethers sulfocyaniques,
Compt. Rend., 1901, 132, 57-58. [all data]
Finke, Scott, et al., 1952
Finke, H.L.; Scott, D.W.; Gross, M.E.; Waddington, G.; Huffman, H.M.,
The entropy and vapor pressure of 1-pentanethiol,
J. Am. Chem. Soc., 1952, 74, 2804-2806. [all data]
Aldrich Chemical Company Inc., 1990
Aldrich Chemical Company Inc.,
Catalog Handbook of Fine Chemicals, Aldrich Chemical Company, Inc., Milwaukee WI, 1990, 1. [all data]
American Tokyo Kasei, 1988
American Tokyo Kasei,
TCI American Organic Chemical 88/89 Catalog, American Tokyo Kasei, Portland, OR, 1988, 1610. [all data]
Majer and Svoboda, 1985
Majer, V.; Svoboda, V.,
Enthalpies of Vaporization of Organic Compounds: A Critical Review and Data Compilation, Blackwell Scientific Publications, Oxford, 1985, 300. [all data]
Cossar, Fournier, et al., 1962
Cossar, B.C.; Fournier, J.O.; Fields, D.L.; Reynolds, D.D.,
Prepartion of Thiols,
J. Org. Chem., 1962, 27, 93. [all data]
Mann and Purdie, 1935
Mann, F.G.; Purdie, D.,
The Constitution of Complex Metallic Salts III. The Parachors of Palladium and Mercury in Simple and Complex Compounds,
J. Chem. Soc., 1935, 1935, 1549. [all data]
Teets, 1934
Teets, D.E.,
The Relation of the Melting Point to the Number of Carbon Atoms in a Series of Normal Mercaptans,
J. Am. Chem. Soc., 1934, 56, 1143. [all data]
Ellis and Reid, 1932
Ellis, L.M.; Reid, E.E.,
The Preparation and Properties of A Double Series of Aliphatic Mercaptans,
J. Am. Chem. Soc., 1932, 54, 1674. [all data]
Finke, McCullough, et al., 1970
Finke, H.L.; McCullough, J.P.; Messerly, J.F.; Guthrie, G.B.; Douslin, D.R.,
Chemical thermodynamic properties for 1-alkanethiols,
J. Chem. Thermodyn., 1970, 2, 27. [all data]
Finke, Scott, et al., 1952, 2
Finke, H.L.; Scott, D.W.; Gross, M.E.; Waddington, G.; Huffman, H.M.,
The entropy and vapor pressure of 1-pentanethiol,
J. Am. Chem. Soc., 1952, 74, 2804. [all data]
Reid, 1972
Reid, Robert C.,
Handbook on vapor pressure and heats of vaporization of hydrocarbons and related compounds, R. C. Wilhort and B. J. Zwolinski, Texas A Research Foundation. College Station, Texas(1971). 329 pages.$10.00,
AIChE J., 1972, 18, 6, 1278-1278, https://doi.org/10.1002/aic.690180637
. [all data]
Finke, Hossenlopp, et al., 1965
Finke, H.L.; Hossenlopp, I.A.; Berg, W.T.,
1-pentanethiol: Heat of vaporization and heat capacity of the vapor,
J. Phys. Chem., 1965, 69, 3030. [all data]
Dykyj, Svoboda, et al., 1999
Dykyj, J.; Svoboda, J.; Wilhoit, R.C.; Frenkel, M.L.; Hall, K.R.,
Vapor Pressure of Chemicals: Part A. Vapor Pressure and Antoine Constants for Hydrocarbons and Sulfur, Selenium, Tellurium and Hydrogen Containing Organic Compounds, Springer, Berlin, 1999, 373. [all data]
Stephenson and Malanowski, 1987
Stephenson, Richard M.; Malanowski, Stanislaw,
Handbook of the Thermodynamics of Organic Compounds, 1987, https://doi.org/10.1007/978-94-009-3173-2
. [all data]
Osborn and Douslin, 1966
Osborn, A.G.; Douslin, D.R.,
Vapor Pressure Relations of 36 Sulfur Compounds Present in Petroleum.,
J. Chem. Eng. Data, 1966, 11, 4, 502-509, https://doi.org/10.1021/je60031a014
. [all data]
Finke, Hossenlopp, et al., 1965, 2
Finke, Herman L.; Hossenlopp, Isham A.; Berg, William T.,
1-Pentanethiol: Heat of Vaporization and Heat Capacity of the Vapor 1,
J. Phys. Chem., 1965, 69, 9, 3030-3031, https://doi.org/10.1021/j100893a035
. [all data]
Domalski and Hearing, 1996
Domalski, Eugene S.; Hearing, Elizabeth D.,
Heat Capacities and Entropies of Organic Compounds in the Condensed Phase. Volume III,
J. Phys. Chem. Ref. Data, 1996, 25, 1, 1, https://doi.org/10.1063/1.555985
. [all data]
Janousek, Reed, et al., 1980
Janousek, B.K.; Reed, K.J.; Brauman, J.I.,
Electron photodetachment from mercaptyl anions (RS- electron affinities of mercaptyl radicals and the S-H bond strength in mercaptans),
J. Am. Chem. Soc., 1980, 102, 3125. [all data]
Sunner, 1955, 2
Sunner, S.,
Strain in 6,8-thioctic acid,
Nature (London), 1955, 176, 217. [all data]