Oxygen anion
- Formula: O2-
- Molecular weight: 31.9993
- IUPAC Standard InChIKey: OUUQCZGPVNCOIJ-UHFFFAOYSA-M
- CAS Registry Number: 11062-77-4
- Chemical structure:
View 3d structure (requires JavaScript / HTML 5) - Permanent link for this species. Use this link for bookmarking this species for future reference.

Gas phase thermochemistry data

Data compiled as indicated in comments:
B - John E. Bartmess
Quantity | Value | Units | Method | Reference | Comment |
---|---|---|---|---|---|
ΔfH°gas | -10.33 ± 0.14 | kcal/mol | R-EA | Ervin, Anusiewicz, et al., 2003 | B |
Quantity | Value | Units | Method | Reference | Comment |
S°gas,1 bar | 50.093 | cal/mol*K | Review | Chase, 1998 | Data last reviewed in September, 1977 |

Reaction thermochemistry data

Data compiled as indicated in comments:
B - John E. Bartmess
M - Michael M. Meot-Ner (Mautner) and Sharon G. Lias
Individual Reactions
By formula: O2- + O2 = (O2- • O2)
Quantity | Value | Units | Method | Reference | Comment |
---|---|---|---|---|---|
ΔrH° | 12. ± 4. | kcal/mol | AVG | N/A | Average of 5 out of 7 values; Individual data points |
Quantity | Value | Units | Method | Reference | Comment |
ΔrS° | 24.4 | cal/mol*K | PHPMS | Hiraoka, 1988 | gas phase; M |
ΔrS° | 32. | cal/mol*K | PHPMS | Conway and Nesbit, 1968 | gas phase; M |
Quantity | Value | Units | Method | Reference | Comment |
ΔrG° | 3.2 ± 1.1 | kcal/mol | TDAs | Hiraoka, 1888 | gas phase; see also Sherwood, Hanold, et al., 1996. Aquino, Taylor, et al., 2001 calns indicate rectangular anion; B |
ΔrG° | 5.4 ± 1.0 | kcal/mol | IMRE | Payzant J.D. and Kebarle, 1972 | gas phase; B |
ΔrG° | 3.2 ± 1.0 | kcal/mol | IMRE | Pack and Phelps, 1971 | gas phase; B |
ΔrG° | 4.00 ± 0.50 | kcal/mol | IMRE | Parkes, 1971 | gas phase; B |
ΔrG° | 3.8 ± 1.0 | kcal/mol | TDAs | Conway and Nesbit, 1968 | gas phase; B |
Free energy of reaction
ΔrG° (kcal/mol) | T (K) | Method | Reference | Comment |
---|---|---|---|---|
3.5 | 300. | DT | Pack and Phelps, 1971 | gas phase; M |
By formula: O2- + CO2 = (O2- • CO2)
Quantity | Value | Units | Method | Reference | Comment |
---|---|---|---|---|---|
ΔrH° | 19.00 ± 0.20 | kcal/mol | TDAs | Hiraoka and Yamabe, 1992 | gas phase; B,M |
ΔrH° | 17.7 ± 1.8 | kcal/mol | IMRE | Pack and Phelps, 1966 | gas phase; Corrected with more recent EA(O2) = 0.45 eV; B,M |
ΔrH° | 25.4 ± 4.6 | kcal/mol | PDis | Vestal and Mauclaire, 1977 | gas phase; B |
Quantity | Value | Units | Method | Reference | Comment |
ΔrS° | 24.2 | cal/mol*K | PHPMS | Hiraoka and Yamabe, 1992 | gas phase; M |
ΔrS° | 21. | cal/mol*K | DT | Pack and Phelps, 1966 | gas phase; M |
Quantity | Value | Units | Method | Reference | Comment |
ΔrG° | 11.7 ± 2.0 | kcal/mol | TDAs | Hiraoka and Yamabe, 1992 | gas phase; B |
ΔrG° | 12.2 ± 1.2 | kcal/mol | IMRE | Pack and Phelps, 1966 | gas phase; Corrected with more recent EA(O2) = 0.45 eV; B |
ΔrG° | 10.0 | kcal/mol | FA | Adams and Bohme, 1970 | gas phase; switching reaction(O2-)O2; Conway and Nesbit, 1968; M |
Free energy of reaction
ΔrG° (kcal/mol) | T (K) | Method | Reference | Comment |
---|---|---|---|---|
12.9 | 296. | FA | Fehsenfeld and Ferguson, 1974 | gas phase; switching reaction(O2-)H2O; Arshadi and Kebarle, 1970; M |
By formula: (O2- • H2O) + H2O = (O2- • 2H2O)
Quantity | Value | Units | Method | Reference | Comment |
---|---|---|---|---|---|
ΔrH° | 17.2 ± 1.0 | kcal/mol | TDAs | Arshadi and Kebarle, 1970 | gas phase; B,M |
Quantity | Value | Units | Method | Reference | Comment |
ΔrS° | 25.1 | cal/mol*K | PHPMS | Arshadi and Kebarle, 1970 | gas phase; M |
Quantity | Value | Units | Method | Reference | Comment |
ΔrG° | 9.70 | kcal/mol | TDAs | Arshadi and Kebarle, 1970 | gas phase; B |
ΔrG° | 8.5 ± 1.0 | kcal/mol | IMRE | Payzant J.D. and Kebarle, 1972 | gas phase; B |
ΔrG° | 9.7 ± 1.0 | kcal/mol | IMRE | Pack and Phelps, 1971 | gas phase; B |
Free energy of reaction
ΔrG° (kcal/mol) | T (K) | Method | Reference | Comment |
---|---|---|---|---|
8.4 | 300. | PHPMS | Payzant J.D. and Kebarle, 1972 | gas phase; M |
By formula: (O2- • 2H2O) + H2O = (O2- • 3H2O)
Quantity | Value | Units | Method | Reference | Comment |
---|---|---|---|---|---|
ΔrH° | 15.4 ± 1.0 | kcal/mol | TDAs | Arshadi and Kebarle, 1970 | gas phase; B,M |
Quantity | Value | Units | Method | Reference | Comment |
ΔrS° | 28.2 | cal/mol*K | PHPMS | Arshadi and Kebarle, 1970 | gas phase; M |
Quantity | Value | Units | Method | Reference | Comment |
ΔrG° | 7.00 | kcal/mol | TDAs | Arshadi and Kebarle, 1970 | gas phase; B |
ΔrG° | 6.1 ± 2.0 | kcal/mol | TDAs | Kebarle, Arshadi, et al., 1968 | gas phase; B,M |
Free energy of reaction
ΔrG° (kcal/mol) | T (K) | Method | Reference | Comment |
---|---|---|---|---|
5.3 | 296. | FA | Fehsenfeld and Ferguson, 1974 | gas phase; M |
7.1 | 300. | PHPMS | Payzant J.D. and Kebarle, 1972 | gas phase; M |
By formula: O2- + H2O = (O2- • H2O)
Quantity | Value | Units | Method | Reference | Comment |
---|---|---|---|---|---|
ΔrH° | 22.3 ± 1.5 | kcal/mol | N/A | Luong, Clements, et al., 2001 | gas phase; Vertical Detachment Energy: 2.03±0.05 eV.; B |
ΔrH° | 18.4 ± 2.0 | kcal/mol | TDAs | Arshadi and Kebarle, 1970 | gas phase; B,M |
Quantity | Value | Units | Method | Reference | Comment |
ΔrS° | 20.1 | cal/mol*K | PHPMS | Arshadi and Kebarle, 1970 | gas phase; M |
Quantity | Value | Units | Method | Reference | Comment |
ΔrG° | 12.5 ± 2.0 | kcal/mol | TDAs | Arshadi and Kebarle, 1970 | gas phase; B |
ΔrG° | 11.7 ± 2.0 | kcal/mol | IMRE | Parkes, 1971 | gas phase; B |
By formula: (O2- • 7N2 • O2) + N2 = (O2- • 8N2 • O2)
Quantity | Value | Units | Method | Reference | Comment |
---|---|---|---|---|---|
ΔrH° | 1.6 ± 0.3 | kcal/mol | PHPMS | Hiraoka, 1988, 2 | gas phase; M |
ΔrH° | 1.53 | kcal/mol | PHPMS | Hiraoka, 1988, 2 | gas phase; Entropy change calculated or estimated; M |
Quantity | Value | Units | Method | Reference | Comment |
ΔrS° | 17.9 | cal/mol*K | PHPMS | Hiraoka, 1988, 2 | gas phase; M |
ΔrS° | 18.0 | cal/mol*K | N/A | Hiraoka, 1988, 2 | gas phase; Entropy change calculated or estimated; M |
By formula: (O2- • 2N2O) + N2O = (O2- • 3N2O)
Quantity | Value | Units | Method | Reference | Comment |
---|---|---|---|---|---|
ΔrH° | 6.40 ± 0.20 | kcal/mol | TDAs | Hiraoka, Fujimaki, et al., 1994 | gas phase; B,M |
Quantity | Value | Units | Method | Reference | Comment |
ΔrS° | 24. | cal/mol*K | PHPMS | Hiraoka, Fujimaki, et al., 1994 | gas phase; M |
Quantity | Value | Units | Method | Reference | Comment |
ΔrG° | -0.8 ± 1.0 | kcal/mol | TDAs | Hiraoka, Fujimaki, et al., 1994 | gas phase; B |
By formula: (O2- • 3N2O) + N2O = (O2- • 4N2O)
Quantity | Value | Units | Method | Reference | Comment |
---|---|---|---|---|---|
ΔrH° | 5.70 ± 0.20 | kcal/mol | TDAs | Hiraoka, Fujimaki, et al., 1994 | gas phase; B,M |
Quantity | Value | Units | Method | Reference | Comment |
ΔrS° | 24. | cal/mol*K | PHPMS | Hiraoka, Fujimaki, et al., 1994 | gas phase; M |
Quantity | Value | Units | Method | Reference | Comment |
ΔrG° | -1.5 ± 1.0 | kcal/mol | TDAs | Hiraoka, Fujimaki, et al., 1994 | gas phase; B |
By formula: (O2- • 4N2O) + N2O = (O2- • 5N2O)
Quantity | Value | Units | Method | Reference | Comment |
---|---|---|---|---|---|
ΔrH° | 5.30 ± 0.20 | kcal/mol | TDAs | Hiraoka, Fujimaki, et al., 1994 | gas phase; B,M |
Quantity | Value | Units | Method | Reference | Comment |
ΔrS° | 24. | cal/mol*K | PHPMS | Hiraoka, Fujimaki, et al., 1994 | gas phase; M |
Quantity | Value | Units | Method | Reference | Comment |
ΔrG° | -1.9 ± 1.0 | kcal/mol | TDAs | Hiraoka, Fujimaki, et al., 1994 | gas phase; B |
By formula: (O2- • 5N2O) + N2O = (O2- • 6N2O)
Quantity | Value | Units | Method | Reference | Comment |
---|---|---|---|---|---|
ΔrH° | 5.00 ± 0.20 | kcal/mol | TDAs | Hiraoka, Fujimaki, et al., 1994 | gas phase; B,M |
Quantity | Value | Units | Method | Reference | Comment |
ΔrS° | 24. | cal/mol*K | PHPMS | Hiraoka, Fujimaki, et al., 1994 | gas phase; M |
Quantity | Value | Units | Method | Reference | Comment |
ΔrG° | -2.2 ± 1.0 | kcal/mol | TDAs | Hiraoka, Fujimaki, et al., 1994 | gas phase; B |
By formula: (O2- • N2O) + N2O = (O2- • 2N2O)
Quantity | Value | Units | Method | Reference | Comment |
---|---|---|---|---|---|
ΔrH° | 8.70 ± 0.20 | kcal/mol | TDAs | Hiraoka, Fujimaki, et al., 1994 | gas phase; B,M |
Quantity | Value | Units | Method | Reference | Comment |
ΔrS° | 27. | cal/mol*K | PHPMS | Hiraoka, Fujimaki, et al., 1994 | gas phase; M |
Quantity | Value | Units | Method | Reference | Comment |
ΔrG° | 0.6 ± 1.0 | kcal/mol | TDAs | Hiraoka, Fujimaki, et al., 1994 | gas phase; B |
By formula: (O2- • 2CH4O) + CH4O = (O2- • 3CH4O)
Quantity | Value | Units | Method | Reference | Comment |
---|---|---|---|---|---|
ΔrH° | 13.50 ± 0.70 | kcal/mol | TDAs | Yamdagni, Payzant, et al., 1973 | gas phase; B,M |
Quantity | Value | Units | Method | Reference | Comment |
ΔrS° | 27.9 | cal/mol*K | PHPMS | Yamdagni, Payzant, et al., 1973 | gas phase; M |
Quantity | Value | Units | Method | Reference | Comment |
ΔrG° | 5.20 ± 0.30 | kcal/mol | TDAs | Yamdagni, Payzant, et al., 1973 | gas phase; B |
By formula: (O2- • 2C2H3N) + C2H3N = (O2- • 3C2H3N)
Quantity | Value | Units | Method | Reference | Comment |
---|---|---|---|---|---|
ΔrH° | 11.90 ± 0.60 | kcal/mol | TDAs | Yamdagni, Payzant, et al., 1973 | gas phase; B,M |
Quantity | Value | Units | Method | Reference | Comment |
ΔrS° | 24.7 | cal/mol*K | PHPMS | Yamdagni, Payzant, et al., 1973 | gas phase; M |
Quantity | Value | Units | Method | Reference | Comment |
ΔrG° | 4.50 ± 0.20 | kcal/mol | TDAs | Yamdagni, Payzant, et al., 1973 | gas phase; B |
By formula: O2- + N2O = (O2- • N2O)
Quantity | Value | Units | Method | Reference | Comment |
---|---|---|---|---|---|
ΔrH° | <13.60 | kcal/mol | IMRB | Adams and Bohme, 1970 | gas phase; N2O..O2- + O2 -> O4- + N2O; B |
ΔrH° | 8.8 | kcal/mol | PHPMS | Hiraoka, Fujimaki, et al., 1994 | gas phase; M |
Quantity | Value | Units | Method | Reference | Comment |
ΔrS° | 27. | cal/mol*K | PHPMS | Hiraoka, Fujimaki, et al., 1994 | gas phase; M |
By formula: (O2- • 3C2H3N) + C2H3N = (O2- • 4C2H3N)
Quantity | Value | Units | Method | Reference | Comment |
---|---|---|---|---|---|
ΔrH° | 9.50 ± 0.50 | kcal/mol | TDAs | Yamdagni, Payzant, et al., 1973 | gas phase; B,M |
Quantity | Value | Units | Method | Reference | Comment |
ΔrS° | 22.4 | cal/mol*K | PHPMS | Yamdagni, Payzant, et al., 1973 | gas phase; M |
Quantity | Value | Units | Method | Reference | Comment |
ΔrG° | 2.80 ± 0.10 | kcal/mol | TDAs | Yamdagni, Payzant, et al., 1973 | gas phase; B |
By formula: (O2- • CH4O) + CH4O = (O2- • 2CH4O)
Quantity | Value | Units | Method | Reference | Comment |
---|---|---|---|---|---|
ΔrH° | 15.50 ± 0.80 | kcal/mol | TDAs | Yamdagni, Payzant, et al., 1973 | gas phase; B,M |
Quantity | Value | Units | Method | Reference | Comment |
ΔrS° | 24.8 | cal/mol*K | PHPMS | Yamdagni, Payzant, et al., 1973 | gas phase; M |
Quantity | Value | Units | Method | Reference | Comment |
ΔrG° | 8.10 ± 0.40 | kcal/mol | TDAs | Yamdagni, Payzant, et al., 1973 | gas phase; B |
By formula: (O2- • C2H3N) + C2H3N = (O2- • 2C2H3N)
Quantity | Value | Units | Method | Reference | Comment |
---|---|---|---|---|---|
ΔrH° | 14.20 ± 0.70 | kcal/mol | TDAs | Yamdagni, Payzant, et al., 1973 | gas phase; B,M |
Quantity | Value | Units | Method | Reference | Comment |
ΔrS° | 22.0 | cal/mol*K | PHPMS | Yamdagni, Payzant, et al., 1973 | gas phase; M |
Quantity | Value | Units | Method | Reference | Comment |
ΔrG° | 7.70 ± 0.40 | kcal/mol | TDAs | Yamdagni, Payzant, et al., 1973 | gas phase; B |
By formula: (O2- • 2CO2) + CO2 = (O2- • 3CO2)
Quantity | Value | Units | Method | Reference | Comment |
---|---|---|---|---|---|
ΔrH° | 6.3 ± 1.0 | kcal/mol | TDAs | Hiraoka and Yamabe, 1992 | gas phase; B,M |
Quantity | Value | Units | Method | Reference | Comment |
ΔrS° | 23.0 | cal/mol*K | PHPMS | Hiraoka and Yamabe, 1992 | gas phase; M |
Quantity | Value | Units | Method | Reference | Comment |
ΔrG° | -0.6 ± 1.0 | kcal/mol | TDAs | Hiraoka and Yamabe, 1992 | gas phase; B |
By formula: (O2- • 3CO2) + CO2 = (O2- • 4CO2)
Quantity | Value | Units | Method | Reference | Comment |
---|---|---|---|---|---|
ΔrH° | 4.8 ± 1.0 | kcal/mol | TDAs | Hiraoka and Yamabe, 1992 | gas phase; B,M |
Quantity | Value | Units | Method | Reference | Comment |
ΔrS° | 18.7 | cal/mol*K | PHPMS | Hiraoka and Yamabe, 1992 | gas phase; M |
Quantity | Value | Units | Method | Reference | Comment |
ΔrG° | -0.8 ± 1.0 | kcal/mol | TDAs | Hiraoka and Yamabe, 1992 | gas phase; B |
By formula: (O2- • 4CO2) + CO2 = (O2- • 5CO2)
Quantity | Value | Units | Method | Reference | Comment |
---|---|---|---|---|---|
ΔrH° | 4.5 ± 1.0 | kcal/mol | TDAs | Hiraoka and Yamabe, 1992 | gas phase; B,M |
Quantity | Value | Units | Method | Reference | Comment |
ΔrS° | 18.4 | cal/mol*K | PHPMS | Hiraoka and Yamabe, 1992 | gas phase; M |
Quantity | Value | Units | Method | Reference | Comment |
ΔrG° | -1.1 ± 1.0 | kcal/mol | TDAs | Hiraoka and Yamabe, 1992 | gas phase; B |
By formula: (O2- • 5CO2) + CO2 = (O2- • 6CO2)
Quantity | Value | Units | Method | Reference | Comment |
---|---|---|---|---|---|
ΔrH° | 4.2 ± 1.0 | kcal/mol | TDAs | Hiraoka and Yamabe, 1992 | gas phase; B,M |
Quantity | Value | Units | Method | Reference | Comment |
ΔrS° | 19.0 | cal/mol*K | PHPMS | Hiraoka and Yamabe, 1992 | gas phase; M |
Quantity | Value | Units | Method | Reference | Comment |
ΔrG° | -1.5 ± 1.0 | kcal/mol | TDAs | Hiraoka and Yamabe, 1992 | gas phase; B |
By formula: (O2- • 6CO2) + CO2 = (O2- • 7CO2)
Quantity | Value | Units | Method | Reference | Comment |
---|---|---|---|---|---|
ΔrH° | 4.0 ± 1.0 | kcal/mol | TDAs | Hiraoka and Yamabe, 1992 | gas phase; B,M |
Quantity | Value | Units | Method | Reference | Comment |
ΔrS° | 19.3 | cal/mol*K | PHPMS | Hiraoka and Yamabe, 1992 | gas phase; M |
Quantity | Value | Units | Method | Reference | Comment |
ΔrG° | -1.8 ± 1.0 | kcal/mol | TDAs | Hiraoka and Yamabe, 1992 | gas phase; B |
By formula: (O2- • CO2) + CO2 = (O2- • 2CO2)
Quantity | Value | Units | Method | Reference | Comment |
---|---|---|---|---|---|
ΔrH° | 6.60 ± 0.20 | kcal/mol | TDAs | Hiraoka and Yamabe, 1992 | gas phase; B,M |
Quantity | Value | Units | Method | Reference | Comment |
ΔrS° | 18.2 | cal/mol*K | PHPMS | Hiraoka and Yamabe, 1992 | gas phase; M |
Quantity | Value | Units | Method | Reference | Comment |
ΔrG° | 1.1 ± 1.0 | kcal/mol | TDAs | Hiraoka and Yamabe, 1992 | gas phase; B |
By formula: O2- + CH4O = (O2- • CH4O)
Quantity | Value | Units | Method | Reference | Comment |
---|---|---|---|---|---|
ΔrH° | 19.10 | kcal/mol | TDAs | Yamdagni, Payzant, et al., 1973 | gas phase; B,M |
Quantity | Value | Units | Method | Reference | Comment |
ΔrS° | 21.9 | cal/mol*K | PHPMS | Yamdagni, Payzant, et al., 1973 | gas phase; M |
Quantity | Value | Units | Method | Reference | Comment |
ΔrG° | 12.50 | kcal/mol | TDAs | Yamdagni, Payzant, et al., 1973 | gas phase; B |
By formula: O2- + C2H3N = (O2- • C2H3N)
Quantity | Value | Units | Method | Reference | Comment |
---|---|---|---|---|---|
ΔrH° | 16.40 | kcal/mol | TDAs | Yamdagni, Payzant, et al., 1973 | gas phase; B,M |
Quantity | Value | Units | Method | Reference | Comment |
ΔrS° | 17.4 | cal/mol*K | PHPMS | Yamdagni, Payzant, et al., 1973 | gas phase; M |
Quantity | Value | Units | Method | Reference | Comment |
ΔrG° | 11.20 | kcal/mol | TDAs | Yamdagni, Payzant, et al., 1973 | gas phase; B |
By formula: (O2- • 6O2) + O2 = (O2- • 7O2)
Quantity | Value | Units | Method | Reference | Comment |
---|---|---|---|---|---|
ΔrH° | 1.40 | kcal/mol | PHPMS | Hiraoka, 1988 | gas phase; Entropy change calculated or estimated; M |
Quantity | Value | Units | Method | Reference | Comment |
ΔrS° | 16. | cal/mol*K | N/A | Hiraoka, 1988 | gas phase; Entropy change calculated or estimated; M |
By formula: O2- + N2 = (O2- • N2)
Quantity | Value | Units | Method | Reference | Comment |
---|---|---|---|---|---|
ΔrH° | 6.0 ± 1.0 | kcal/mol | N/A | Posey and Johnson, 1988 | gas phase; B |
ΔrH° | <13.60 | kcal/mol | IMRB | Adams and Bohme, 1970 | gas phase; N2..O2- + O2 -> O4-; B |
By formula: O2- + CO = (O2- • CO)
Quantity | Value | Units | Method | Reference | Comment |
---|---|---|---|---|---|
ΔrH° | <13.60 | kcal/mol | IMRB | Adams and Bohme, 1970 | gas phase; CO..O2- + O2 -> O4- + CO. G3MP2B3 calculations indicate a HOF(A-) ca. -38 kcal/mol; B |
By formula: (O2- • 2N2 • O2) + N2 = (O2- • 3N2 • O2)
Quantity | Value | Units | Method | Reference | Comment |
---|---|---|---|---|---|
ΔrH° | 2.5 ± 0.2 | kcal/mol | PHPMS | Hiraoka, 1988, 2 | gas phase; M |
Quantity | Value | Units | Method | Reference | Comment |
ΔrS° | 18.3 | cal/mol*K | PHPMS | Hiraoka, 1988, 2 | gas phase; M |
By formula: (O2- • 3N2 • O2) + N2 = (O2- • 4N2 • O2)
Quantity | Value | Units | Method | Reference | Comment |
---|---|---|---|---|---|
ΔrH° | 2.2 ± 0.2 | kcal/mol | PHPMS | Hiraoka, 1988, 2 | gas phase; M |
Quantity | Value | Units | Method | Reference | Comment |
ΔrS° | 18.7 | cal/mol*K | PHPMS | Hiraoka, 1988, 2 | gas phase; M |
By formula: (O2- • 4N2 • O2) + N2 = (O2- • 5N2 • O2)
Quantity | Value | Units | Method | Reference | Comment |
---|---|---|---|---|---|
ΔrH° | 1.9 ± 0.2 | kcal/mol | PHPMS | Hiraoka, 1988, 2 | gas phase; M |
Quantity | Value | Units | Method | Reference | Comment |
ΔrS° | 19.5 | cal/mol*K | PHPMS | Hiraoka, 1988, 2 | gas phase; M |
By formula: (O2- • 5N2 • O2) + N2 = (O2- • 6N2 • O2)
Quantity | Value | Units | Method | Reference | Comment |
---|---|---|---|---|---|
ΔrH° | 1.8 ± 0.2 | kcal/mol | PHPMS | Hiraoka, 1988, 2 | gas phase; M |
Quantity | Value | Units | Method | Reference | Comment |
ΔrS° | 19.5 | cal/mol*K | PHPMS | Hiraoka, 1988, 2 | gas phase; M |
By formula: (O2- • 6N2 • O2) + N2 = (O2- • 7N2 • O2)
Quantity | Value | Units | Method | Reference | Comment |
---|---|---|---|---|---|
ΔrH° | 1.7 ± 0.2 | kcal/mol | PHPMS | Hiraoka, 1988, 2 | gas phase; M |
Quantity | Value | Units | Method | Reference | Comment |
ΔrS° | 18.8 | cal/mol*K | PHPMS | Hiraoka, 1988, 2 | gas phase; M |
By formula: (O2- • N2 • O2) + N2 = (O2- • 2N2 • O2)
Quantity | Value | Units | Method | Reference | Comment |
---|---|---|---|---|---|
ΔrH° | 2.8 ± 0.2 | kcal/mol | PHPMS | Hiraoka, 1988, 2 | gas phase; M |
Quantity | Value | Units | Method | Reference | Comment |
ΔrS° | 17.9 | cal/mol*K | PHPMS | Hiraoka, 1988, 2 | gas phase; M |
By formula: (O2- • 4294967295O) + O = O2-
Quantity | Value | Units | Method | Reference | Comment |
---|---|---|---|---|---|
ΔrH° | 95.78 | kcal/mol | N/A | Ervin, Anusiewicz, et al., 2003 | gas phase; B |
ΔrH° | 95.8 ± 1.0 | kcal/mol | Ther | Travers, Cowles, et al., 1989 | gas phase; B |
Quantity | Value | Units | Method | Reference | Comment |
---|---|---|---|---|---|
ΔrH° | 352.99 ± 0.72 | kcal/mol | D-EA | Travers, Cowles, et al., 1989 | gas phase; B |
Quantity | Value | Units | Method | Reference | Comment |
ΔrG° | 346.67 ± 0.82 | kcal/mol | H-TS | Travers, Cowles, et al., 1989 | gas phase; B |
By formula: (O2- • O2) + N2 = (O2- • N2 • O2)
Quantity | Value | Units | Method | Reference | Comment |
---|---|---|---|---|---|
ΔrH° | 2.9 ± 0.2 | kcal/mol | PHPMS | Hiraoka, 1988, 2 | gas phase; M |
Quantity | Value | Units | Method | Reference | Comment |
ΔrS° | 16.5 | cal/mol*K | PHPMS | Hiraoka, 1988, 2 | gas phase; M |
By formula: (O2- • 3H2O) + H2O = (O2- • 4H2O)
Quantity | Value | Units | Method | Reference | Comment |
---|---|---|---|---|---|
ΔrG° | 4.4 ± 2.0 | kcal/mol | TDAs | Kebarle, Arshadi, et al., 1968 | gas phase; B,M |
ΔrG° | 3.4 | kcal/mol | PHPMS | Arshadi and Kebarle, 1970 | gas phase; M |
By formula: (O2- • 2O2) + O2 = (O2- • 3O2)
Quantity | Value | Units | Method | Reference | Comment |
---|---|---|---|---|---|
ΔrH° | 2.4 ± 0.2 | kcal/mol | PHPMS | Hiraoka, 1988 | gas phase; M |
Quantity | Value | Units | Method | Reference | Comment |
ΔrS° | 21.3 | cal/mol*K | PHPMS | Hiraoka, 1988 | gas phase; M |
By formula: (O2- • 3O2) + O2 = (O2- • 4O2)
Quantity | Value | Units | Method | Reference | Comment |
---|---|---|---|---|---|
ΔrH° | 1.8 ± 0.3 | kcal/mol | PHPMS | Hiraoka, 1988 | gas phase; M |
Quantity | Value | Units | Method | Reference | Comment |
ΔrS° | 15.4 | cal/mol*K | PHPMS | Hiraoka, 1988 | gas phase; M |
By formula: (O2- • 4O2) + O2 = (O2- • 5O2)
Quantity | Value | Units | Method | Reference | Comment |
---|---|---|---|---|---|
ΔrH° | 1.5 ± 0.2 | kcal/mol | PHPMS | Hiraoka, 1988 | gas phase; M |
Quantity | Value | Units | Method | Reference | Comment |
ΔrS° | 15.4 | cal/mol*K | PHPMS | Hiraoka, 1988 | gas phase; M |
By formula: (O2- • 5O2) + O2 = (O2- • 6O2)
Quantity | Value | Units | Method | Reference | Comment |
---|---|---|---|---|---|
ΔrH° | 1.5 ± 0.3 | kcal/mol | PHPMS | Hiraoka, 1988 | gas phase; M |
Quantity | Value | Units | Method | Reference | Comment |
ΔrS° | 16.2 | cal/mol*K | PHPMS | Hiraoka, 1988 | gas phase; M |
By formula: (O2- • O2) + O2 = (O2- • 2O2)
Quantity | Value | Units | Method | Reference | Comment |
---|---|---|---|---|---|
ΔrH° | 2.5 ± 0.2 | kcal/mol | PHPMS | Hiraoka, 1988 | gas phase; M |
Quantity | Value | Units | Method | Reference | Comment |
ΔrS° | 20.9 | cal/mol*K | PHPMS | Hiraoka, 1988 | gas phase; M |
By formula: (O2- • H2O) + CO2 = (O2- • CO2 • H2O)
Free energy of reaction
ΔrG° (kcal/mol) | T (K) | Method | Reference | Comment |
---|---|---|---|---|
8.2 | 296. | FA | Fehsenfeld and Ferguson, 1974 | gas phase; switching reaction(O2-)2H2O; Arshadi and Kebarle, 1970; M |
+
= C5H5NO2-
By formula: O2- + C5H5N = C5H5NO2-
Quantity | Value | Units | Method | Reference | Comment |
---|---|---|---|---|---|
ΔrH° | 21.7 ± 2.3 | kcal/mol | N/A | Le Barbu, Schiedt, et al., 2002 | gas phase; Affinity is difference in EAs of lesser solvated species; B |
+
= C6H6O2-
By formula: O2- + C6H6 = C6H6O2-
Quantity | Value | Units | Method | Reference | Comment |
---|---|---|---|---|---|
ΔrH° | 14.1 ± 2.3 | kcal/mol | N/A | Le Barbu, Schiedt, et al., 2002 | gas phase; Affinity is difference in EAs of lesser solvated species; B |
+
= C10H8O2-
By formula: O2- + C10H8 = C10H8O2-
Quantity | Value | Units | Method | Reference | Comment |
---|---|---|---|---|---|
ΔrH° | 22.1 ± 2.3 | kcal/mol | N/A | Le Barbu, Schiedt, et al., 2002 | gas phase; Affinity is difference in EAs of lesser solvated species; B |
By formula: O2- + Ar = (O2- • Ar)
Quantity | Value | Units | Method | Reference | Comment |
---|---|---|---|---|---|
ΔrH° | 1.66 | kcal/mol | N/A | Bowen and Eaton, 1988 | gas phase; Bound by 70 meV relative to EA(O2-.); B |
By formula: (O2- • 4H2O) + H2O = (O2- • 5H2O)
Quantity | Value | Units | Method | Reference | Comment |
---|---|---|---|---|---|
ΔrG° | 3.3 ± 2.0 | kcal/mol | TDAs | Kebarle, Arshadi, et al., 1968 | gas phase; B |

Gas phase ion energetics data

Data compiled by: John E. Bartmess
Protonation reactions
Quantity | Value | Units | Method | Reference | Comment |
---|---|---|---|---|---|
ΔrH° | 352.99 ± 0.72 | kcal/mol | D-EA | Travers, Cowles, et al., 1989 | gas phase |
Quantity | Value | Units | Method | Reference | Comment |
ΔrG° | 346.67 ± 0.82 | kcal/mol | H-TS | Travers, Cowles, et al., 1989 | gas phase |

Ion clustering data

Data compiled as indicated in comments:
B - John E. Bartmess
M - Michael M. Meot-Ner (Mautner) and Sharon G. Lias
Clustering reactions
By formula: O2- + Ar = (O2- • Ar)
Quantity | Value | Units | Method | Reference | Comment |
---|---|---|---|---|---|
ΔrH° | 1.66 | kcal/mol | N/A | Bowen and Eaton, 1988 | gas phase; Bound by 70 meV relative to EA(O2-.); B |
By formula: O2- + CH4O = (O2- • CH4O)
Quantity | Value | Units | Method | Reference | Comment |
---|---|---|---|---|---|
ΔrH° | 19.10 | kcal/mol | TDAs | Yamdagni, Payzant, et al., 1973 | gas phase; B,M |
Quantity | Value | Units | Method | Reference | Comment |
ΔrS° | 21.9 | cal/mol*K | PHPMS | Yamdagni, Payzant, et al., 1973 | gas phase; M |
Quantity | Value | Units | Method | Reference | Comment |
ΔrG° | 12.50 | kcal/mol | TDAs | Yamdagni, Payzant, et al., 1973 | gas phase; B |
By formula: (O2- • CH4O) + CH4O = (O2- • 2CH4O)
Quantity | Value | Units | Method | Reference | Comment |
---|---|---|---|---|---|
ΔrH° | 15.50 ± 0.80 | kcal/mol | TDAs | Yamdagni, Payzant, et al., 1973 | gas phase; B,M |
Quantity | Value | Units | Method | Reference | Comment |
ΔrS° | 24.8 | cal/mol*K | PHPMS | Yamdagni, Payzant, et al., 1973 | gas phase; M |
Quantity | Value | Units | Method | Reference | Comment |
ΔrG° | 8.10 ± 0.40 | kcal/mol | TDAs | Yamdagni, Payzant, et al., 1973 | gas phase; B |
By formula: (O2- • 2CH4O) + CH4O = (O2- • 3CH4O)
Quantity | Value | Units | Method | Reference | Comment |
---|---|---|---|---|---|
ΔrH° | 13.50 ± 0.70 | kcal/mol | TDAs | Yamdagni, Payzant, et al., 1973 | gas phase; B,M |
Quantity | Value | Units | Method | Reference | Comment |
ΔrS° | 27.9 | cal/mol*K | PHPMS | Yamdagni, Payzant, et al., 1973 | gas phase; M |
Quantity | Value | Units | Method | Reference | Comment |
ΔrG° | 5.20 ± 0.30 | kcal/mol | TDAs | Yamdagni, Payzant, et al., 1973 | gas phase; B |
By formula: O2- + CO = (O2- • CO)
Quantity | Value | Units | Method | Reference | Comment |
---|---|---|---|---|---|
ΔrH° | <13.60 | kcal/mol | IMRB | Adams and Bohme, 1970 | gas phase; CO..O2- + O2 -> O4- + CO. G3MP2B3 calculations indicate a HOF(A-) ca. -38 kcal/mol; B |
By formula: O2- + CO2 = (O2- • CO2)
Quantity | Value | Units | Method | Reference | Comment |
---|---|---|---|---|---|
ΔrH° | 19.00 ± 0.20 | kcal/mol | TDAs | Hiraoka and Yamabe, 1992 | gas phase; B,M |
ΔrH° | 17.7 ± 1.8 | kcal/mol | IMRE | Pack and Phelps, 1966 | gas phase; Corrected with more recent EA(O2) = 0.45 eV; B,M |
ΔrH° | 25.4 ± 4.6 | kcal/mol | PDis | Vestal and Mauclaire, 1977 | gas phase; B |
Quantity | Value | Units | Method | Reference | Comment |
ΔrS° | 24.2 | cal/mol*K | PHPMS | Hiraoka and Yamabe, 1992 | gas phase; M |
ΔrS° | 21. | cal/mol*K | DT | Pack and Phelps, 1966 | gas phase; M |
Quantity | Value | Units | Method | Reference | Comment |
ΔrG° | 11.7 ± 2.0 | kcal/mol | TDAs | Hiraoka and Yamabe, 1992 | gas phase; B |
ΔrG° | 12.2 ± 1.2 | kcal/mol | IMRE | Pack and Phelps, 1966 | gas phase; Corrected with more recent EA(O2) = 0.45 eV; B |
ΔrG° | 10.0 | kcal/mol | FA | Adams and Bohme, 1970 | gas phase; switching reaction(O2-)O2; Conway and Nesbit, 1968; M |
Free energy of reaction
ΔrG° (kcal/mol) | T (K) | Method | Reference | Comment |
---|---|---|---|---|
12.9 | 296. | FA | Fehsenfeld and Ferguson, 1974 | gas phase; switching reaction(O2-)H2O; Arshadi and Kebarle, 1970; M |
By formula: (O2- • CO2) + CO2 = (O2- • 2CO2)
Quantity | Value | Units | Method | Reference | Comment |
---|---|---|---|---|---|
ΔrH° | 6.60 ± 0.20 | kcal/mol | TDAs | Hiraoka and Yamabe, 1992 | gas phase; B,M |
Quantity | Value | Units | Method | Reference | Comment |
ΔrS° | 18.2 | cal/mol*K | PHPMS | Hiraoka and Yamabe, 1992 | gas phase; M |
Quantity | Value | Units | Method | Reference | Comment |
ΔrG° | 1.1 ± 1.0 | kcal/mol | TDAs | Hiraoka and Yamabe, 1992 | gas phase; B |
By formula: (O2- • 2CO2) + CO2 = (O2- • 3CO2)
Quantity | Value | Units | Method | Reference | Comment |
---|---|---|---|---|---|
ΔrH° | 6.3 ± 1.0 | kcal/mol | TDAs | Hiraoka and Yamabe, 1992 | gas phase; B,M |
Quantity | Value | Units | Method | Reference | Comment |
ΔrS° | 23.0 | cal/mol*K | PHPMS | Hiraoka and Yamabe, 1992 | gas phase; M |
Quantity | Value | Units | Method | Reference | Comment |
ΔrG° | -0.6 ± 1.0 | kcal/mol | TDAs | Hiraoka and Yamabe, 1992 | gas phase; B |
By formula: (O2- • 3CO2) + CO2 = (O2- • 4CO2)
Quantity | Value | Units | Method | Reference | Comment |
---|---|---|---|---|---|
ΔrH° | 4.8 ± 1.0 | kcal/mol | TDAs | Hiraoka and Yamabe, 1992 | gas phase; B,M |
Quantity | Value | Units | Method | Reference | Comment |
ΔrS° | 18.7 | cal/mol*K | PHPMS | Hiraoka and Yamabe, 1992 | gas phase; M |
Quantity | Value | Units | Method | Reference | Comment |
ΔrG° | -0.8 ± 1.0 | kcal/mol | TDAs | Hiraoka and Yamabe, 1992 | gas phase; B |
By formula: (O2- • 4CO2) + CO2 = (O2- • 5CO2)
Quantity | Value | Units | Method | Reference | Comment |
---|---|---|---|---|---|
ΔrH° | 4.5 ± 1.0 | kcal/mol | TDAs | Hiraoka and Yamabe, 1992 | gas phase; B,M |
Quantity | Value | Units | Method | Reference | Comment |
ΔrS° | 18.4 | cal/mol*K | PHPMS | Hiraoka and Yamabe, 1992 | gas phase; M |
Quantity | Value | Units | Method | Reference | Comment |
ΔrG° | -1.1 ± 1.0 | kcal/mol | TDAs | Hiraoka and Yamabe, 1992 | gas phase; B |
By formula: (O2- • 5CO2) + CO2 = (O2- • 6CO2)
Quantity | Value | Units | Method | Reference | Comment |
---|---|---|---|---|---|
ΔrH° | 4.2 ± 1.0 | kcal/mol | TDAs | Hiraoka and Yamabe, 1992 | gas phase; B,M |
Quantity | Value | Units | Method | Reference | Comment |
ΔrS° | 19.0 | cal/mol*K | PHPMS | Hiraoka and Yamabe, 1992 | gas phase; M |
Quantity | Value | Units | Method | Reference | Comment |
ΔrG° | -1.5 ± 1.0 | kcal/mol | TDAs | Hiraoka and Yamabe, 1992 | gas phase; B |
By formula: (O2- • 6CO2) + CO2 = (O2- • 7CO2)
Quantity | Value | Units | Method | Reference | Comment |
---|---|---|---|---|---|
ΔrH° | 4.0 ± 1.0 | kcal/mol | TDAs | Hiraoka and Yamabe, 1992 | gas phase; B,M |
Quantity | Value | Units | Method | Reference | Comment |
ΔrS° | 19.3 | cal/mol*K | PHPMS | Hiraoka and Yamabe, 1992 | gas phase; M |
Quantity | Value | Units | Method | Reference | Comment |
ΔrG° | -1.8 ± 1.0 | kcal/mol | TDAs | Hiraoka and Yamabe, 1992 | gas phase; B |
By formula: O2- + C2H3N = (O2- • C2H3N)
Quantity | Value | Units | Method | Reference | Comment |
---|---|---|---|---|---|
ΔrH° | 16.40 | kcal/mol | TDAs | Yamdagni, Payzant, et al., 1973 | gas phase; B,M |
Quantity | Value | Units | Method | Reference | Comment |
ΔrS° | 17.4 | cal/mol*K | PHPMS | Yamdagni, Payzant, et al., 1973 | gas phase; M |
Quantity | Value | Units | Method | Reference | Comment |
ΔrG° | 11.20 | kcal/mol | TDAs | Yamdagni, Payzant, et al., 1973 | gas phase; B |
By formula: (O2- • C2H3N) + C2H3N = (O2- • 2C2H3N)
Quantity | Value | Units | Method | Reference | Comment |
---|---|---|---|---|---|
ΔrH° | 14.20 ± 0.70 | kcal/mol | TDAs | Yamdagni, Payzant, et al., 1973 | gas phase; B,M |
Quantity | Value | Units | Method | Reference | Comment |
ΔrS° | 22.0 | cal/mol*K | PHPMS | Yamdagni, Payzant, et al., 1973 | gas phase; M |
Quantity | Value | Units | Method | Reference | Comment |
ΔrG° | 7.70 ± 0.40 | kcal/mol | TDAs | Yamdagni, Payzant, et al., 1973 | gas phase; B |
By formula: (O2- • 2C2H3N) + C2H3N = (O2- • 3C2H3N)
Quantity | Value | Units | Method | Reference | Comment |
---|---|---|---|---|---|
ΔrH° | 11.90 ± 0.60 | kcal/mol | TDAs | Yamdagni, Payzant, et al., 1973 | gas phase; B,M |
Quantity | Value | Units | Method | Reference | Comment |
ΔrS° | 24.7 | cal/mol*K | PHPMS | Yamdagni, Payzant, et al., 1973 | gas phase; M |
Quantity | Value | Units | Method | Reference | Comment |
ΔrG° | 4.50 ± 0.20 | kcal/mol | TDAs | Yamdagni, Payzant, et al., 1973 | gas phase; B |
By formula: (O2- • 3C2H3N) + C2H3N = (O2- • 4C2H3N)
Quantity | Value | Units | Method | Reference | Comment |
---|---|---|---|---|---|
ΔrH° | 9.50 ± 0.50 | kcal/mol | TDAs | Yamdagni, Payzant, et al., 1973 | gas phase; B,M |
Quantity | Value | Units | Method | Reference | Comment |
ΔrS° | 22.4 | cal/mol*K | PHPMS | Yamdagni, Payzant, et al., 1973 | gas phase; M |
Quantity | Value | Units | Method | Reference | Comment |
ΔrG° | 2.80 ± 0.10 | kcal/mol | TDAs | Yamdagni, Payzant, et al., 1973 | gas phase; B |
+
= C5H5NO2-
By formula: O2- + C5H5N = C5H5NO2-
Quantity | Value | Units | Method | Reference | Comment |
---|---|---|---|---|---|
ΔrH° | 21.7 ± 2.3 | kcal/mol | N/A | Le Barbu, Schiedt, et al., 2002 | gas phase; Affinity is difference in EAs of lesser solvated species; B |
+
= C6H6O2-
By formula: O2- + C6H6 = C6H6O2-
Quantity | Value | Units | Method | Reference | Comment |
---|---|---|---|---|---|
ΔrH° | 14.1 ± 2.3 | kcal/mol | N/A | Le Barbu, Schiedt, et al., 2002 | gas phase; Affinity is difference in EAs of lesser solvated species; B |
+
= C10H8O2-
By formula: O2- + C10H8 = C10H8O2-
Quantity | Value | Units | Method | Reference | Comment |
---|---|---|---|---|---|
ΔrH° | 22.1 ± 2.3 | kcal/mol | N/A | Le Barbu, Schiedt, et al., 2002 | gas phase; Affinity is difference in EAs of lesser solvated species; B |
By formula: O2- + H2O = (O2- • H2O)
Quantity | Value | Units | Method | Reference | Comment |
---|---|---|---|---|---|
ΔrH° | 22.3 ± 1.5 | kcal/mol | N/A | Luong, Clements, et al., 2001 | gas phase; Vertical Detachment Energy: 2.03±0.05 eV.; B |
ΔrH° | 18.4 ± 2.0 | kcal/mol | TDAs | Arshadi and Kebarle, 1970 | gas phase; B,M |
Quantity | Value | Units | Method | Reference | Comment |
ΔrS° | 20.1 | cal/mol*K | PHPMS | Arshadi and Kebarle, 1970 | gas phase; M |
Quantity | Value | Units | Method | Reference | Comment |
ΔrG° | 12.5 ± 2.0 | kcal/mol | TDAs | Arshadi and Kebarle, 1970 | gas phase; B |
ΔrG° | 11.7 ± 2.0 | kcal/mol | IMRE | Parkes, 1971 | gas phase; B |
By formula: (O2- • H2O) + CO2 = (O2- • CO2 • H2O)
Free energy of reaction
ΔrG° (kcal/mol) | T (K) | Method | Reference | Comment |
---|---|---|---|---|
8.2 | 296. | FA | Fehsenfeld and Ferguson, 1974 | gas phase; switching reaction(O2-)2H2O; Arshadi and Kebarle, 1970; M |
By formula: (O2- • H2O) + H2O = (O2- • 2H2O)
Quantity | Value | Units | Method | Reference | Comment |
---|---|---|---|---|---|
ΔrH° | 17.2 ± 1.0 | kcal/mol | TDAs | Arshadi and Kebarle, 1970 | gas phase; B,M |
Quantity | Value | Units | Method | Reference | Comment |
ΔrS° | 25.1 | cal/mol*K | PHPMS | Arshadi and Kebarle, 1970 | gas phase; M |
Quantity | Value | Units | Method | Reference | Comment |
ΔrG° | 9.70 | kcal/mol | TDAs | Arshadi and Kebarle, 1970 | gas phase; B |
ΔrG° | 8.5 ± 1.0 | kcal/mol | IMRE | Payzant J.D. and Kebarle, 1972 | gas phase; B |
ΔrG° | 9.7 ± 1.0 | kcal/mol | IMRE | Pack and Phelps, 1971 | gas phase; B |
Free energy of reaction
ΔrG° (kcal/mol) | T (K) | Method | Reference | Comment |
---|---|---|---|---|
8.4 | 300. | PHPMS | Payzant J.D. and Kebarle, 1972 | gas phase; M |
By formula: (O2- • 2H2O) + H2O = (O2- • 3H2O)
Quantity | Value | Units | Method | Reference | Comment |
---|---|---|---|---|---|
ΔrH° | 15.4 ± 1.0 | kcal/mol | TDAs | Arshadi and Kebarle, 1970 | gas phase; B,M |
Quantity | Value | Units | Method | Reference | Comment |
ΔrS° | 28.2 | cal/mol*K | PHPMS | Arshadi and Kebarle, 1970 | gas phase; M |
Quantity | Value | Units | Method | Reference | Comment |
ΔrG° | 7.00 | kcal/mol | TDAs | Arshadi and Kebarle, 1970 | gas phase; B |
ΔrG° | 6.1 ± 2.0 | kcal/mol | TDAs | Kebarle, Arshadi, et al., 1968 | gas phase; B,M |
Free energy of reaction
ΔrG° (kcal/mol) | T (K) | Method | Reference | Comment |
---|---|---|---|---|
5.3 | 296. | FA | Fehsenfeld and Ferguson, 1974 | gas phase; M |
7.1 | 300. | PHPMS | Payzant J.D. and Kebarle, 1972 | gas phase; M |
By formula: (O2- • 3H2O) + H2O = (O2- • 4H2O)
Quantity | Value | Units | Method | Reference | Comment |
---|---|---|---|---|---|
ΔrG° | 4.4 ± 2.0 | kcal/mol | TDAs | Kebarle, Arshadi, et al., 1968 | gas phase; B,M |
ΔrG° | 3.4 | kcal/mol | PHPMS | Arshadi and Kebarle, 1970 | gas phase; M |
By formula: (O2- • 4H2O) + H2O = (O2- • 5H2O)
Quantity | Value | Units | Method | Reference | Comment |
---|---|---|---|---|---|
ΔrG° | 3.3 ± 2.0 | kcal/mol | TDAs | Kebarle, Arshadi, et al., 1968 | gas phase; B |
By formula: O2- + N2O = (O2- • N2O)
Quantity | Value | Units | Method | Reference | Comment |
---|---|---|---|---|---|
ΔrH° | <13.60 | kcal/mol | IMRB | Adams and Bohme, 1970 | gas phase; N2O..O2- + O2 -> O4- + N2O; B |
ΔrH° | 8.8 | kcal/mol | PHPMS | Hiraoka, Fujimaki, et al., 1994 | gas phase; M |
Quantity | Value | Units | Method | Reference | Comment |
ΔrS° | 27. | cal/mol*K | PHPMS | Hiraoka, Fujimaki, et al., 1994 | gas phase; M |
By formula: (O2- • N2O) + N2O = (O2- • 2N2O)
Quantity | Value | Units | Method | Reference | Comment |
---|---|---|---|---|---|
ΔrH° | 8.70 ± 0.20 | kcal/mol | TDAs | Hiraoka, Fujimaki, et al., 1994 | gas phase; B,M |
Quantity | Value | Units | Method | Reference | Comment |
ΔrS° | 27. | cal/mol*K | PHPMS | Hiraoka, Fujimaki, et al., 1994 | gas phase; M |
Quantity | Value | Units | Method | Reference | Comment |
ΔrG° | 0.6 ± 1.0 | kcal/mol | TDAs | Hiraoka, Fujimaki, et al., 1994 | gas phase; B |
By formula: (O2- • 2N2O) + N2O = (O2- • 3N2O)
Quantity | Value | Units | Method | Reference | Comment |
---|---|---|---|---|---|
ΔrH° | 6.40 ± 0.20 | kcal/mol | TDAs | Hiraoka, Fujimaki, et al., 1994 | gas phase; B,M |
Quantity | Value | Units | Method | Reference | Comment |
ΔrS° | 24. | cal/mol*K | PHPMS | Hiraoka, Fujimaki, et al., 1994 | gas phase; M |
Quantity | Value | Units | Method | Reference | Comment |
ΔrG° | -0.8 ± 1.0 | kcal/mol | TDAs | Hiraoka, Fujimaki, et al., 1994 | gas phase; B |
By formula: (O2- • 3N2O) + N2O = (O2- • 4N2O)
Quantity | Value | Units | Method | Reference | Comment |
---|---|---|---|---|---|
ΔrH° | 5.70 ± 0.20 | kcal/mol | TDAs | Hiraoka, Fujimaki, et al., 1994 | gas phase; B,M |
Quantity | Value | Units | Method | Reference | Comment |
ΔrS° | 24. | cal/mol*K | PHPMS | Hiraoka, Fujimaki, et al., 1994 | gas phase; M |
Quantity | Value | Units | Method | Reference | Comment |
ΔrG° | -1.5 ± 1.0 | kcal/mol | TDAs | Hiraoka, Fujimaki, et al., 1994 | gas phase; B |
By formula: (O2- • 4N2O) + N2O = (O2- • 5N2O)
Quantity | Value | Units | Method | Reference | Comment |
---|---|---|---|---|---|
ΔrH° | 5.30 ± 0.20 | kcal/mol | TDAs | Hiraoka, Fujimaki, et al., 1994 | gas phase; B,M |
Quantity | Value | Units | Method | Reference | Comment |
ΔrS° | 24. | cal/mol*K | PHPMS | Hiraoka, Fujimaki, et al., 1994 | gas phase; M |
Quantity | Value | Units | Method | Reference | Comment |
ΔrG° | -1.9 ± 1.0 | kcal/mol | TDAs | Hiraoka, Fujimaki, et al., 1994 | gas phase; B |
By formula: (O2- • 5N2O) + N2O = (O2- • 6N2O)
Quantity | Value | Units | Method | Reference | Comment |
---|---|---|---|---|---|
ΔrH° | 5.00 ± 0.20 | kcal/mol | TDAs | Hiraoka, Fujimaki, et al., 1994 | gas phase; B,M |
Quantity | Value | Units | Method | Reference | Comment |
ΔrS° | 24. | cal/mol*K | PHPMS | Hiraoka, Fujimaki, et al., 1994 | gas phase; M |
Quantity | Value | Units | Method | Reference | Comment |
ΔrG° | -2.2 ± 1.0 | kcal/mol | TDAs | Hiraoka, Fujimaki, et al., 1994 | gas phase; B |
By formula: O2- + N2 = (O2- • N2)
Quantity | Value | Units | Method | Reference | Comment |
---|---|---|---|---|---|
ΔrH° | 6.0 ± 1.0 | kcal/mol | N/A | Posey and Johnson, 1988 | gas phase; B |
ΔrH° | <13.60 | kcal/mol | IMRB | Adams and Bohme, 1970 | gas phase; N2..O2- + O2 -> O4-; B |
By formula: (O2- • N2 • O2) + N2 = (O2- • 2N2 • O2)
Quantity | Value | Units | Method | Reference | Comment |
---|---|---|---|---|---|
ΔrH° | 2.8 ± 0.2 | kcal/mol | PHPMS | Hiraoka, 1988, 2 | gas phase; M |
Quantity | Value | Units | Method | Reference | Comment |
ΔrS° | 17.9 | cal/mol*K | PHPMS | Hiraoka, 1988, 2 | gas phase; M |
By formula: (O2- • 2N2 • O2) + N2 = (O2- • 3N2 • O2)
Quantity | Value | Units | Method | Reference | Comment |
---|---|---|---|---|---|
ΔrH° | 2.5 ± 0.2 | kcal/mol | PHPMS | Hiraoka, 1988, 2 | gas phase; M |
Quantity | Value | Units | Method | Reference | Comment |
ΔrS° | 18.3 | cal/mol*K | PHPMS | Hiraoka, 1988, 2 | gas phase; M |
By formula: (O2- • 3N2 • O2) + N2 = (O2- • 4N2 • O2)
Quantity | Value | Units | Method | Reference | Comment |
---|---|---|---|---|---|
ΔrH° | 2.2 ± 0.2 | kcal/mol | PHPMS | Hiraoka, 1988, 2 | gas phase; M |
Quantity | Value | Units | Method | Reference | Comment |
ΔrS° | 18.7 | cal/mol*K | PHPMS | Hiraoka, 1988, 2 | gas phase; M |
By formula: (O2- • 4N2 • O2) + N2 = (O2- • 5N2 • O2)
Quantity | Value | Units | Method | Reference | Comment |
---|---|---|---|---|---|
ΔrH° | 1.9 ± 0.2 | kcal/mol | PHPMS | Hiraoka, 1988, 2 | gas phase; M |
Quantity | Value | Units | Method | Reference | Comment |
ΔrS° | 19.5 | cal/mol*K | PHPMS | Hiraoka, 1988, 2 | gas phase; M |
By formula: (O2- • 5N2 • O2) + N2 = (O2- • 6N2 • O2)
Quantity | Value | Units | Method | Reference | Comment |
---|---|---|---|---|---|
ΔrH° | 1.8 ± 0.2 | kcal/mol | PHPMS | Hiraoka, 1988, 2 | gas phase; M |
Quantity | Value | Units | Method | Reference | Comment |
ΔrS° | 19.5 | cal/mol*K | PHPMS | Hiraoka, 1988, 2 | gas phase; M |
By formula: (O2- • 6N2 • O2) + N2 = (O2- • 7N2 • O2)
Quantity | Value | Units | Method | Reference | Comment |
---|---|---|---|---|---|
ΔrH° | 1.7 ± 0.2 | kcal/mol | PHPMS | Hiraoka, 1988, 2 | gas phase; M |
Quantity | Value | Units | Method | Reference | Comment |
ΔrS° | 18.8 | cal/mol*K | PHPMS | Hiraoka, 1988, 2 | gas phase; M |
By formula: (O2- • 7N2 • O2) + N2 = (O2- • 8N2 • O2)
Quantity | Value | Units | Method | Reference | Comment |
---|---|---|---|---|---|
ΔrH° | 1.6 ± 0.3 | kcal/mol | PHPMS | Hiraoka, 1988, 2 | gas phase; M |
ΔrH° | 1.53 | kcal/mol | PHPMS | Hiraoka, 1988, 2 | gas phase; Entropy change calculated or estimated; M |
Quantity | Value | Units | Method | Reference | Comment |
ΔrS° | 17.9 | cal/mol*K | PHPMS | Hiraoka, 1988, 2 | gas phase; M |
ΔrS° | 18.0 | cal/mol*K | N/A | Hiraoka, 1988, 2 | gas phase; Entropy change calculated or estimated; M |
By formula: (O2- • 4294967295O) + O = O2-
Quantity | Value | Units | Method | Reference | Comment |
---|---|---|---|---|---|
ΔrH° | 95.78 | kcal/mol | N/A | Ervin, Anusiewicz, et al., 2003 | gas phase; B |
ΔrH° | 95.8 ± 1.0 | kcal/mol | Ther | Travers, Cowles, et al., 1989 | gas phase; B |
By formula: O2- + O2 = (O2- • O2)
Quantity | Value | Units | Method | Reference | Comment |
---|---|---|---|---|---|
ΔrH° | 12. ± 4. | kcal/mol | AVG | N/A | Average of 5 out of 7 values; Individual data points |
Quantity | Value | Units | Method | Reference | Comment |
ΔrS° | 24.4 | cal/mol*K | PHPMS | Hiraoka, 1988 | gas phase; M |
ΔrS° | 32. | cal/mol*K | PHPMS | Conway and Nesbit, 1968 | gas phase; M |
Quantity | Value | Units | Method | Reference | Comment |
ΔrG° | 3.2 ± 1.1 | kcal/mol | TDAs | Hiraoka, 1888 | gas phase; see also Sherwood, Hanold, et al., 1996. Aquino, Taylor, et al., 2001 calns indicate rectangular anion; B |
ΔrG° | 5.4 ± 1.0 | kcal/mol | IMRE | Payzant J.D. and Kebarle, 1972 | gas phase; B |
ΔrG° | 3.2 ± 1.0 | kcal/mol | IMRE | Pack and Phelps, 1971 | gas phase; B |
ΔrG° | 4.00 ± 0.50 | kcal/mol | IMRE | Parkes, 1971 | gas phase; B |
ΔrG° | 3.8 ± 1.0 | kcal/mol | TDAs | Conway and Nesbit, 1968 | gas phase; B |
Free energy of reaction
ΔrG° (kcal/mol) | T (K) | Method | Reference | Comment |
---|---|---|---|---|
3.5 | 300. | DT | Pack and Phelps, 1971 | gas phase; M |
By formula: (O2- • O2) + N2 = (O2- • N2 • O2)
Quantity | Value | Units | Method | Reference | Comment |
---|---|---|---|---|---|
ΔrH° | 2.9 ± 0.2 | kcal/mol | PHPMS | Hiraoka, 1988, 2 | gas phase; M |
Quantity | Value | Units | Method | Reference | Comment |
ΔrS° | 16.5 | cal/mol*K | PHPMS | Hiraoka, 1988, 2 | gas phase; M |
By formula: (O2- • O2) + O2 = (O2- • 2O2)
Quantity | Value | Units | Method | Reference | Comment |
---|---|---|---|---|---|
ΔrH° | 2.5 ± 0.2 | kcal/mol | PHPMS | Hiraoka, 1988 | gas phase; M |
Quantity | Value | Units | Method | Reference | Comment |
ΔrS° | 20.9 | cal/mol*K | PHPMS | Hiraoka, 1988 | gas phase; M |
By formula: (O2- • 2O2) + O2 = (O2- • 3O2)
Quantity | Value | Units | Method | Reference | Comment |
---|---|---|---|---|---|
ΔrH° | 2.4 ± 0.2 | kcal/mol | PHPMS | Hiraoka, 1988 | gas phase; M |
Quantity | Value | Units | Method | Reference | Comment |
ΔrS° | 21.3 | cal/mol*K | PHPMS | Hiraoka, 1988 | gas phase; M |
By formula: (O2- • 3O2) + O2 = (O2- • 4O2)
Quantity | Value | Units | Method | Reference | Comment |
---|---|---|---|---|---|
ΔrH° | 1.8 ± 0.3 | kcal/mol | PHPMS | Hiraoka, 1988 | gas phase; M |
Quantity | Value | Units | Method | Reference | Comment |
ΔrS° | 15.4 | cal/mol*K | PHPMS | Hiraoka, 1988 | gas phase; M |
By formula: (O2- • 4O2) + O2 = (O2- • 5O2)
Quantity | Value | Units | Method | Reference | Comment |
---|---|---|---|---|---|
ΔrH° | 1.5 ± 0.2 | kcal/mol | PHPMS | Hiraoka, 1988 | gas phase; M |
Quantity | Value | Units | Method | Reference | Comment |
ΔrS° | 15.4 | cal/mol*K | PHPMS | Hiraoka, 1988 | gas phase; M |
By formula: (O2- • 5O2) + O2 = (O2- • 6O2)
Quantity | Value | Units | Method | Reference | Comment |
---|---|---|---|---|---|
ΔrH° | 1.5 ± 0.3 | kcal/mol | PHPMS | Hiraoka, 1988 | gas phase; M |
Quantity | Value | Units | Method | Reference | Comment |
ΔrS° | 16.2 | cal/mol*K | PHPMS | Hiraoka, 1988 | gas phase; M |
By formula: (O2- • 6O2) + O2 = (O2- • 7O2)
Quantity | Value | Units | Method | Reference | Comment |
---|---|---|---|---|---|
ΔrH° | 1.40 | kcal/mol | PHPMS | Hiraoka, 1988 | gas phase; Entropy change calculated or estimated; M |
Quantity | Value | Units | Method | Reference | Comment |
ΔrS° | 16. | cal/mol*K | N/A | Hiraoka, 1988 | gas phase; Entropy change calculated or estimated; M |

Constants of diatomic molecules

Data compiled by: Klaus P. Huber and Gerhard H. Herzberg

Data collected through March, 1977

Symbols used in the table of constants
SymbolMeaning
State electronic state and / or symmetry symbol
Te minimum electronic energy (cm-1)
ωe vibrational constant – first term (cm-1)
ωexe vibrational constant – second term (cm-1)
ωeye vibrational constant – third term (cm-1)
Be rotational constant in equilibrium position (cm-1)
αe rotational constant – first term (cm-1)
γe rotation-vibration interaction constant (cm-1)
De centrifugal distortion constant (cm-1)
βe rotational constant – first term, centrifugal force (cm-1)
re internuclear distance (Å)
Trans. observed transition(s) corresponding to electronic state
ν00 position of 0-0 band (units noted in table)
Diatomic constants for 16O2-
StateTeωeωexeωeyeBeαeγeDeβereTrans.ν00
b 118540 1290 1          14.27 eV 2
Sanche and Schulz, 1972; Schulz, 1973
a (4Πu) 97800 1044 10 3         11.68 eV 4
Sanche and Schulz, 1972; Schulz, 1973
Additional resonances in the electron transmission current at 8-11 eV. 2
Sanche and Schulz, 1972; Schulz, 1973
Several bound excited states predicted by theoretical calculations Krauss, Neumann, et al., 1973.
StateTeωeωexeωeyeBeαeγeDeβereTrans.ν00
A (2Πu) (25300) (574.5) 5 (7.1) 5        A ↔ X 6 (25000) 7
Rolfe, 1964; Ikezawa and Rolfe, 1973
Photodetachment cross sections 6700 - 4600 Å (14900 - 21800 cm-1).
Cosby, Ling, et al., 1976
X 2Πgi 0 8 1090 9 8.1 9       1.35 10 11
Creighton and Lippincott, 1964; Holzer, Murphy, et al., 1968
EPR sp. 12
Kanzig and Cohen, 1959; Zeller and Kanzig, 1967

References

Ervin, Anusiewicz, et al., 2003
Ervin, K.M.; Anusiewicz, W.; Skurski, P.; Simons, J.; Lineberger, W.C.,
The only stable state of O-2(-) is the X (2)Pi(g) ground state and it (still!) has an adiabatic electron detachment energy of,
J. Phys. Chem. A, 2003, 107, 41, 8521-8529, https://doi.org/10.1021/jp0357323
. [all data]
Chase, 1998
Chase, M.W., Jr.,
NIST-JANAF Themochemical Tables, Fourth Edition,
J. Phys. Chem. Ref. Data, Monograph 9, 1998, 1-1951. [all data]
Hiraoka, 1988
Hiraoka, K.,
A Determination of the Stabilities of O2+(O2)n and O2-(O2)n with n = 1 - 8 from Measurements of the Gas-Phase Ion Equilibria,
J. Chem. Phys., 1988, 89, 5, 3190, https://doi.org/10.1063/1.454976
. [all data]
Conway and Nesbit, 1968
Conway, D.C.; Nesbit, L.E.,
Stability of O4-,
J. Chem. Phys., 1968, 48, 1, 509, https://doi.org/10.1063/1.1667956
. [all data]
Hiraoka, 1888
Hiraoka, K.,
A Determination of the Stability of O2+(O2)n and O2-(O2)n with n=1-8 from Measurements of the Gas Phase Ion Equilibria,
J. Chem. Phys., 1888, 89, 5, 3190, https://doi.org/10.1063/1.454976
. [all data]
Sherwood, Hanold, et al., 1996
Sherwood, C.R.; Hanold, K.A.; Garner, M.C.; Strong, K.M.; Continetti, R.E.,
Translational Spectroscopy Studies of the Photodissociation Dynamics of O4-,
J. Chem. Phys., 1996, 105, 24, 10803, https://doi.org/10.1063/1.472888
. [all data]
Aquino, Taylor, et al., 2001
Aquino, A.J.A.; Taylor, P.R.; Walch, S.P.,
Structure, properties, and photodissociation of O-4(-),
J. Chem. Phys., 2001, 114, 7, 3010-3017, https://doi.org/10.1063/1.1288379
. [all data]
Payzant J.D. and Kebarle, 1972
Payzant J.D.; Kebarle, P.,
Kinetics and Reactions Leading to O2-(H2O)n in Moist Oxygen,
J. Chem. Phys., 1972, 56, 7, 3482, https://doi.org/10.1063/1.1677723
. [all data]
Pack and Phelps, 1971
Pack, J.L.; Phelps, A.V.,
Hydration of Oxygen Negative Ions,
Bull. Am. Phys. Soc., 1971, 16, 214. [all data]
Parkes, 1971
Parkes, D.A.,
Electron Attachment and Negative Ion-Molecule Reactions in Pure O2,
Trans. Farad. Soc., 1971, 97, 711, https://doi.org/10.1039/tf9716700711
. [all data]
Hiraoka and Yamabe, 1992
Hiraoka, K.; Yamabe, S.,
Formation of the Chelate Bonds in the Cluster O2(-)(CO2)n, CO3(-)(CO2)n, and NO2(-)(CO2)n,
J. Chem. Phys., 1992, 97, 1, 643, https://doi.org/10.1063/1.463560
. [all data]
Pack and Phelps, 1966
Pack, J.L.; Phelps, A.V.,
Electron Attachment and Detachment . II. Mixtures of O2 and CO2 and of O2 and H2O,
J. Chem. Phys., 1966, 45, 11, 4316, https://doi.org/10.1063/1.1727491
. [all data]
Vestal and Mauclaire, 1977
Vestal, M.L.; Mauclaire, G.H.,
Photodissociaton of negative ions formed in CO2 and CO2/O2 Mixtures,
J. Chem. Phys., 1977, 67, 3758. [all data]
Adams and Bohme, 1970
Adams, N.G.; Bohme, D.,
Flowing Afterglow Studies of Formation and Reactions of Cluster Ions of O2+, O2-, and O-,
J. Chem. Phys., 1970, 52, 6, 3133, https://doi.org/10.1063/1.1673449
. [all data]
Fehsenfeld and Ferguson, 1974
Fehsenfeld, F.C.; Ferguson, E.E.,
Laboratory studies of negative ion reactions with atmospheric trace constituents,
J. Chem. Phys., 1974, 61, 3181. [all data]
Arshadi and Kebarle, 1970
Arshadi, M.; Kebarle, P.,
Hydration of OH- and O2- in the Gas Phase. Comparative Solvation of OH- by Water and the Hydrogen Halides. Effect of Acidity,
J. Phys. Chem., 1970, 74, 7, 1483, https://doi.org/10.1021/j100702a015
. [all data]
Kebarle, Arshadi, et al., 1968
Kebarle, P.; Arshadi, M.; Scarborough, J.,
Hydration of Negative Ions in the Gas Phase,
J. Chem. Phys., 1968, 49, 2, 817, https://doi.org/10.1063/1.1670145
. [all data]
Luong, Clements, et al., 2001
Luong, A.K.; Clements, T.G.; Resat, M.S.; Continetti, R.E.,
Energetics and dissociative photodetachment dynamics of superoxide-water clusters: O-2(-)(H2O)(n), n=1-6,
J. Chem. Phys., 2001, 114, 8, 3449-3455, https://doi.org/10.1063/1.1342221
. [all data]
Hiraoka, 1988, 2
Hiraoka, K.,
Determination of the Stabilities of O3-(N2)n, O3-(O2)n, and O4-(N2)n from Measurements of the Gas Phase Equilibria,
Chem. Phys., 1988, 125, 2-3, 439, https://doi.org/10.1016/0301-0104(88)87096-4
. [all data]
Hiraoka, Fujimaki, et al., 1994
Hiraoka, K.; Fujimaki, S.; Aruga, K.; Yamabe, S.,
Gas-phase clustering reactions of O2(-), NO-, and O- with N2O: Isomeric structures for (NO-N2O)(-),
J. Phys. Chem., 1994, 98, 34, 8295, https://doi.org/10.1021/j100085a006
. [all data]
Yamdagni, Payzant, et al., 1973
Yamdagni, R.; Payzant, J.D.; Kebarle, P.,
Solvation of Cl- and O2- with H2O, CH3OH, and CH3CN in the gas phase,
Can. J. Chem., 1973, 51, 2507. [all data]
Posey and Johnson, 1988
Posey, L.A.; Johnson, M.A.,
Pulsed Photoelectron Spectroscopy of Negative Cluster Ions: Isolation of Three Distinguishable Forms of N2O2-,
J. Chem. Phys., 1988, 88, 9, 5385, https://doi.org/10.1063/1.454576
. [all data]
Travers, Cowles, et al., 1989
Travers, M.J.; Cowles, D.C.; Ellison, G.B.,
Reinvestigation of the Electron Affinities of O2 and NO,
Chem. Phys. Lett., 1989, 164, 5, 449, https://doi.org/10.1016/0009-2614(89)85237-6
. [all data]
Le Barbu, Schiedt, et al., 2002
Le Barbu, K.; Schiedt, J.; Weinkauf, R.; Schlag, E.W.; Nilles, J.M.; Xu, S.J.; Thomas, O.C.; Bowen, K.H.,
Microsolvation of small anions by aromatic molecules: An exploratory study,
J. Chem. Phys., 2002, 116, 22, 9663-9671, https://doi.org/10.1063/1.1475750
. [all data]
Bowen and Eaton, 1988
Bowen, K.H.; Eaton, J.G.,
Photodetachment Spectroscopy of Negative Cluster Ions,
in The Structure of Small Molecules and Ions, Ed. R. Naaman, Z. Vager, Plenum NY, 1988, 1988, p.147-169. [all data]