1,4-Butanediamine
- Formula: C4H12N2
- Molecular weight: 88.1515
- IUPAC Standard InChIKey: KIDHWZJUCRJVML-UHFFFAOYSA-N
- CAS Registry Number: 110-60-1
- Chemical structure:
View 3d structure (requires JavaScript / HTML 5) - Other names: Putrescine; Butylenediamine; Putrescin; Tetramethylenediamine; 1,4-Butylenediamine; 1,4-Diaminobutane; H2N(CH2)4NH2; Tetramethyldiamine; 1,4-Tetramethylenediamine; 1,4-Diamino-n-butane; NSC 60545

Phase change data

Data compiled as indicated in comments:
BS - Robert L. Brown and Stephen E. Stein
AC - William E. Acree, Jr., James S. Chickos
Quantity | Value | Units | Method | Reference | Comment |
---|---|---|---|---|---|
Tboil | 431.7 | K | N/A | Weast and Grasselli, 1989 | BS |
Enthalpy of fusion
ΔfusH (kJ/mol) | Temperature (K) | Method | Reference | Comment |
---|---|---|---|---|
28.06 | 295.1 | DSC | Dall'Acqua, Della Gatta, et al., 2002 | AC |

Gas phase ion energetics data

Data evaluated as indicated in comments:
HL - Edward P. Hunter and Sharon G. Lias
Data compiled as indicated in comments:
MM - Michael M. Meot-Ner (Mautner)
Quantity | Value | Units | Method | Reference | Comment |
---|---|---|---|---|---|
Proton affinity (review) | 1005.6 | kJ/mol | N/A | Hunter and Lias, 1998 | HL |
Quantity | Value | Units | Method | Reference | Comment |
Gas basicity | 954.3 | kJ/mol | N/A | Hunter and Lias, 1998 | HL |
Proton affinity at 298K
Proton affinity (kJ/mol) | Reference | Comment |
---|---|---|
1005.6 ± 6.7 | Schroeder, Andriole, et al., 2004 | Protonation entropy from EKM measurements may reflect transition state rather than themochemical value; MM |
>982.3 | Bouchoux, Buisson, et al., 2003 | MM |
>977.4 | Bouchoux, Buisson, et al., 2003 | MM |
>991.6 ± 0.2 | Bouchoux, Buisson, et al., 2003 | MM |
993. ± 4. | Hahn and Wesdemiotis, 2003 | MM |
999.1 | Wang, Chu, et al., 1999 | KM results obtained from CID of complexes with secondary amines at E(cm) = 0 eV, extrapolated from CID at E(cm) = 0.8, 1.5, 2.0 eV; MM |
1010. | Wang, Chu, et al., 1999 | KM results obtained from CID of complexes with secondary amines using Fenselau/Wesdemiotis correction; MM |
Gas basicity at 298K
Gas basicity (review) (kJ/mol) | Reference | Comment |
---|---|---|
951.1 | Bouchoux, Buisson, et al., 2003 | MM |
944.5 | Bouchoux, Buisson, et al., 2003 | MM |
960.8 ± 0.2 | Bouchoux, Buisson, et al., 2003 | MM |
Protonation entropy at 298K
Protonation entropy (J/mol*K) | Reference | Comment |
---|---|---|
-83. | Schroeder, Andriole, et al., 2004 | Protonation entropy from EKM measurements may reflect transition state rather than themochemical value; MM |

Kovats' RI, non-polar column, custom temperature program

Column type | Active phase | I | Reference | Comment |
---|---|---|---|---|
Packed | SE-30 | 930. | Ramsey, Lee, et al., 1980 | He, Chromosorb G HP (80-100 mesh); Column length: 1.5 m; Program: not specified |

Van Den Dool and Kratz RI, polar column, temperature ramp

Column type | Active phase | I | Reference | Comment |
---|---|---|---|---|
Capillary | HP-Wax | 1434. | Peng, 2000 | 15. m/0.53 mm/1. μm, He, 40. C @ 3. min, 5. K/min, 220. C @ 30. min |

Normal alkane RI, non-polar column, custom temperature program

Column type | Active phase | I | Reference | Comment |
---|---|---|---|---|
Capillary | OV-1, SE-30, Methyl silicone, SP-2100, OV-101, DB-1, etc. | 930. | Waggott and Davies, 1984 | Hydrogen; Column length: 50. m; Column diameter: 0.32 mm; Program: not specified |
Other | Methyl Silicone | 930. | Ardrey and Moffat, 1981 | Program: not specified |

References

Weast and Grasselli, 1989
CRC Handbook of Data on Organic Compounds, 2nd Editon, Weast,R.C and Grasselli, J.G., ed(s)., CRC Press, Inc., Boca Raton, FL, 1989, 1. [all data]
Dall'Acqua, Della Gatta, et al., 2002
Dall'Acqua, Lorenzo; Della Gatta, Giuseppe; Nowicka, Bozenna; Ferloni, Paolo,
Enthalpies and entropies of fusion of ten alkane-α, ω-diamines H2 N-- (CH 2)n-- NH2 where 3≤n≤12,
The Journal of Chemical Thermodynamics, 2002, 34, 1, 1-12, https://doi.org/10.1006/jcht.2001.0950
. [all data]
Hunter and Lias, 1998
Hunter, E.P.; Lias, S.G.,
Evaluated Gas Phase Basicities and Proton Affinities of Molecules: An Update,
J. Phys. Chem. Ref. Data, 1998, 27, 3, 413-656, https://doi.org/10.1063/1.556018
. [all data]
Schroeder, Andriole, et al., 2004
Schroeder, O.E.; Andriole, E.J.; Carver, K.L.; Colyer, K.E.; Poutsma, J.C.,
Proton affinity of lysine homologues from the extended kinetic method,
J. Phys. Chem. A, 2004, 108, 326. [all data]
Bouchoux, Buisson, et al., 2003
Bouchoux, G.; Buisson, D.A.; Bourcier, S.; Sablier, M.,
Application of the kinetic method to bifunctional bases. ESI tandem quadrupole experiments,
Int. J. Mass Spectrom., 2003, 228, 1035. [all data]
Hahn and Wesdemiotis, 2003
Hahn, I.S.; Wesdemiotis, C.,
Protonation Thermochemistry of beta-Alanine. An Evaluation of Proton Affinities and Entropies Determined by the Extended Kinetic Method,
Int. J. Mass Spectrometry, 2003, 222, 465. [all data]
Wang, Chu, et al., 1999
Wang, Z.; Chu, I.K.; Rodriquez, C.F.; Hopkinson, A.C.; Siu, K.W.M.,
α,ω-Diaminoalkanes as models for bases that dicoordinate the proton: An evaluation of the kinetic method for estimating their proton affinities,
J. Phys. Chem. A., 1999, 103, 8700. [all data]
Ramsey, Lee, et al., 1980
Ramsey, J.D.; Lee, T.D.; Osselton, M.D.; Moffat, A.C.,
Gas-liquid chromatographic retention indices of 296 non-drug substances on SE-30 or OV-1 likely to be encountered in toxicological analyses,
J. Chromatogr., 1980, 184, 2, 185-206, https://doi.org/10.1016/S0021-9673(00)85641-1
. [all data]
Peng, 2000
Peng, C.T.,
Prediction of retention indices. V. Influence of electronic effects and column polarity on retention index,
J. Chromatogr. A, 2000, 903, 1-2, 117-143, https://doi.org/10.1016/S0021-9673(00)00901-8
. [all data]
Waggott and Davies, 1984
Waggott, A.; Davies, I.W.,
Identification of organic pollutants using linear temperature programmed retention indices (LTPRIs) - Part II, 1984, retrieved from http://dwi.defra.gov.uk/research/completed-research/reports/dwi0383.pdf. [all data]
Ardrey and Moffat, 1981
Ardrey, R.E.; Moffat, A.C.,
Gas-liquid chromatographic retention indices of 1318 substances of toxicological interest on SE-30 or OV-1 stationary phase,
J. Chromatogr., 1981, 220, 3, 195-252, https://doi.org/10.1016/S0021-9673(00)81925-1
. [all data]