2-Butene, 1,4-dichloro-, (E)-
- Formula: C4H6Cl2
- Molecular weight: 124.996
- IUPAC Standard InChIKey: FQDIANVAWVHZIR-OWOJBTEDSA-N
- CAS Registry Number: 110-57-6
- Chemical structure:
View 3d structure (requires JavaScript / HTML 5) - Stereoisomers:
- Other names: trans-1,4-Dichloro-2-butene; 1,4-Dichloro-trans-2-butene; 2-Butene, 1,4-dichloro-, trans-; 1,4-Dichloro-2-butene, trans; 1,4-Dichloro-(E)-2-butene; 1,4-Dichlorobutene-2, (E)-; (E)-1,4-Dichloro-2-butene; trans-2,3-dichlorobut-2-ene

Phase change data

Data compiled as indicated in comments:
BS - Robert L. Brown and Stephen E. Stein
AC - William E. Acree, Jr., James S. Chickos
Reduced pressure boiling point
Tboil (K) | Pressure (bar) | Reference | Comment |
---|---|---|---|
348.2 | 0.053 | Aldrich Chemical Company Inc., 1990 | BS |
Enthalpy of vaporization
ΔvapH (kJ/mol) | Temperature (K) | Method | Reference | Comment |
---|---|---|---|---|
45.6 | 355. | A | Stephenson and Malanowski, 1987 | Based on data from 340. to 379. K.; AC |

Reaction thermochemistry data

Data compiled by: Hussein Y. Afeefy, Joel F. Liebman, and Stephen E. Stein
Individual Reactions
By formula: C4H6Cl2 = C4H6Cl2
Quantity | Value | Units | Method | Reference | Comment |
---|---|---|---|---|---|
ΔrH° | -0.71 | kJ/mol | Eqk | Zakharova, Gul'neva, et al., 1991 | gas phase; Heat of isomerization at 383 K |
By formula: C4H6Cl2 = C4H6Cl2
Quantity | Value | Units | Method | Reference | Comment |
---|---|---|---|---|---|
ΔrH° | -4.2 | kJ/mol | Eqk | Levanova, Yanshevskaya, et al., 1986 | liquid phase; solvent: Naphtha |
By formula: C4H6Cl2 = C4H6Cl2
Quantity | Value | Units | Method | Reference | Comment |
---|---|---|---|---|---|
ΔrH° | 6.3 | kJ/mol | Eqk | Levanova, Yanshevskaya, et al., 1986 | liquid phase; solvent: Naphta |

Van Den Dool and Kratz RI, non-polar column, temperature ramp

Column type | Active phase | I | Reference | Comment |
---|---|---|---|---|
Capillary | SE-54 | 930. | Weber, 1986 | 25. m/0.31 mm/0.17 μm, H2, 2. K/min; Tstart: 35. C |

References

Aldrich Chemical Company Inc., 1990
Aldrich Chemical Company Inc.,
Catalog Handbook of Fine Chemicals, Aldrich Chemical Company, Inc., Milwaukee WI, 1990, 1. [all data]
Stephenson and Malanowski, 1987
Stephenson, Richard M.; Malanowski, Stanislaw,
Handbook of the Thermodynamics of Organic Compounds, 1987, https://doi.org/10.1007/978-94-009-3173-2
. [all data]
Zakharova, Gul'neva, et al., 1991
Zakharova, L.A.; Gul'neva, I.V.; Shestakov, G.K.; Temkin, O.N.; Levanova, S.V.; Martirosyan, G.T.; Malkhasyan, A.Ts.; Asatryan, E.M.,
Isomerization of dichlorobutenes,
Kinet. Catal., 1991, 32, 1190-1194, In original 1332. [all data]
Levanova, Yanshevskaya, et al., 1986
Levanova, S.V.; Yanshevskaya, I.V.; Asatryan, E.M.; Saakyan, N.L.; Kostand'yan, V.A.; Malkhasyan, A.Ts.; Martirosyan, G.T.,
Relationships of isomerization of the allylic type,
J. Appl. Chem. USSR, 1986, 59, 790-793. [all data]
Weber, 1986
Weber, L.,
Utilization of the Sadtler standard RI system in micropollution analyses,
J. Hi. Res. Chromatogr. Chromatogr. Comm., 1986, 9, 8, 446-451, https://doi.org/10.1002/jhrc.1240090806
. [all data]