2-Diisopropylaminoethyl ethyl sulfide
- Formula: C10H23NS
- Molecular weight: 189.361
- IUPAC Standard InChIKey: JQECUITYJBGTCT-UHFFFAOYSA-N
- CAS Registry Number: 110501-54-7
- Chemical structure:
View 3d structure (requires JavaScript / HTML 5) - Other names: Ethyl 2-diisopropylaminoethyl sulfide

Van Den Dool and Kratz RI, non-polar column, temperature ramp

Column type | Active phase | I | Reference | Comment |
---|---|---|---|---|
Capillary | OV-1 | 1264. | Kostiainen, 2000 | 15. m/0.32 mm/0.25 μm, He, 50. C @ 2. min, 10. K/min, 280. C @ 10. min |
Capillary | SE-54 | 1277.6 | Kostiainen, 2000 | 25. m/0.32 mm/0.25 μm, He, 40. C @ 1. min, 10. K/min, 280. C @ 10. min |
Capillary | DB-1 | 1264. | D'agostino, Provost, et al., 1987 | 15. m/0.32 mm/0.25 μm, He, 50. C @ 2. min, 10. K/min, 280. C @ 10. min |
Capillary | DB-5 | 1277.6 | D'agostino, Provost, et al., 1987 | 15. m/0.32 mm/0.25 μm, He, 50. C @ 2. min, 10. K/min, 280. C @ 10. min |

Normal alkane RI, non-polar column, temperature ramp

Column type | Active phase | I | Reference | Comment |
---|---|---|---|---|
Capillary | DB-5 | 1264. | Savel'eva, Zenkevich, et al., 2003 | 25. m/0.20 mm/0.33 μm, Helium, 40. C @ 1. min, 5. K/min, 270. C @ 15. min |

References

Kostiainen, 2000
Kostiainen, O.,
Gas Chromatography in Screening of Chemicals Related to the Chemical Weapons Convention
in Encyclopedia of Analytical Chemistry, Meyers, R.A., ed(s)., John Wiley Sons Ltd, Chichester, 2000, 963-979. [all data]
D'agostino, Provost, et al., 1987
D'agostino, P.A.; Provost, L.R.; Visentini, J.,
Analysis of O-Ethyl S-[2-(Diisopropylamino)ethyl] Methylphosphonothiolate (VX) by Capillary Column Gas Chromatography-Mass Spectrometry,
J. Chromatogr., 1987, 402, 221-232, https://doi.org/10.1016/0021-9673(87)80020-1
. [all data]
Savel'eva, Zenkevich, et al., 2003
Savel'eva, E.I.; Zenkevich, I.G.; Radilov, A.S.,
Identification the Products of Chemical Neutralization of O-Isobutyl-S-(2-diethylaminoethyl)methylthiophosphonate in the Composition of Bitumen-Salt Matrices,
Zh. Anal. Khim. (Rus.), 2003, 58, 2, 135-145. [all data]