Propanenitrile, 3-(1-methylethoxy)-
- Formula: C6H11NO
- Molecular weight: 113.1576
- IUPAC Standard InChIKey: BMSYXLRQGIFLFO-UHFFFAOYSA-N
- CAS Registry Number: 110-47-4
- Chemical structure:
View 3d structure (requires JavaScript / HTML 5) - Other names: Propionitrile, 3-isopropoxy-; β-Isopropoxypropionitrile; 3-Isopropoxypropionitrile; Beta-iso-propoxypropionitrile; Propanenitrile, 3-(1-methylethyloxy); 3-isopropoxypropiononitrile

Normal alkane RI, non-polar column, custom temperature program

Column type | Active phase | I | Reference | Comment |
---|---|---|---|---|
Capillary | Polydimethyl siloxanes | 879. | Zenkevich, 1997 | Program: not specified |

References

Zenkevich, 1997
Zenkevich, I.G.,
Influence of the Variations of Dynamics Molecular Parameterts on the Additivity of Chromatigraphic Retention Indices of Products of Organic Reactions Relative to Initial Reagents,
Dokl. Akad. Nauk (Rus.), 1997, 353, 5, 625-627. [all data]