Elemene
- Formula: C15H24
- Molecular weight: 204.3511
- IUPAC Standard InChIKey: OPFTUNCRGUEPRZ-UHFFFAOYSA-N
- CAS Registry Number: 11029-06-4
- Chemical structure:
View 3d structure (requires JavaScript / HTML 5) - Species with the same structure:
- Stereoisomers:

Van Den Dool and Kratz RI, non-polar column, temperature ramp

Column type | Active phase | I | Reference | Comment |
---|---|---|---|---|
Capillary | HP-5 | 1445. | Liu J.M., Nan P., et al., 2006 | 30. m/0.25 mm/0.25 μm, He, 60. C @ 2. min, 10. K/min, 250. C @ 10. min |
Capillary | BP-1 | 1494. | Sinyinda and Gramshaw, 1998 | He, 5. C @ 5. min, 5. K/min, 250. C @ 30. min; Column length: 25. m; Column diameter: 0.32 mm |

Normal alkane RI, polar column, custom temperature program

Column type | Active phase | I | Reference | Comment |
---|---|---|---|---|
Capillary | DB-Wax | 1576. | Welke, Manfroi, et al., 2012 | 30. m/0.25 mm/0.25 μm, Helium; Program: not specified |
Capillary | DB-Wax | 1582. | Welke, Manfroi, et al., 2012 | 30. m/0.25 mm/0.25 μm, Helium; Program: not specified |
Capillary | Polyethylene Glycol | 1628. | Vernin, Metzger, et al., 1990 | Program: not specified |

References

Liu J.M., Nan P., et al., 2006
Liu J.M.; Nan P.; Tsering Q.; Tsering T.; Bai Z.K.; Wang L.; Liu Z.J.; Zhong Y.,
Volatile constituents of the leaves and flowers of Salvia przewalskii Maxim. from Tibet,
Flavour Fragr. J., 2006, 21, 3, 435-438, https://doi.org/10.1002/ffj.1607
. [all data]
Sinyinda and Gramshaw, 1998
Sinyinda, S.; Gramshaw, J.W.,
Volatiles of avocado fruit,
Food Chem., 1998, 62, 4, 483-487, https://doi.org/10.1016/S0308-8146(97)00190-8
. [all data]
Welke, Manfroi, et al., 2012
Welke, J.E.; Manfroi, V.; Zanus, M.; Lazarotto, M.; Zini, C.A.,
Characterization of the volatile profile of Brazilian merlot wines through comprehensive two dimensional gas chromatography time-of-flight mass spectrometric detection,
J. Chromatogr. A, 2012, 1226, 124-139, https://doi.org/10.1016/j.chroma.2012.01.002
. [all data]
Vernin, Metzger, et al., 1990
Vernin, G.; Metzger, J.; Suon, K.-N.; Fraisse, D.; Ghiglione, C.; Hamoud, A.; Parkanyi, C/,
GC-MS-SPECMA bank analysis of essential oils and aromas. GC-MS (EI-PCI) data bank analysis of sesquiterpenic compounds in Juniper needle oil - application of the mass fragmentometry SIM technique,
Lebensm.-Wiss. u.-Technol., 1990, 23, 25-33. [all data]