Cedrene

Van Den Dool and Kratz RI, non-polar column, temperature ramp

View large format table.

Column type Active phase I Reference Comment
CapillaryDB-Petro1415.1Pang T., Zhu S., et al., 200750. m/0.2 mm/0.5 μm, 2. K/min; Tstart: 50. C; Tend: 270. C
CapillaryDB-Petro1415.1Pang T., Zhu S., et al., 200750. m/0.2 mm/0.5 μm, 2. K/min; Tstart: 50. C; Tend: 270. C
CapillaryHP-51397.Sartoratto, Machado, et al., 200425. m/0.2 mm/0.33 μm, He, 3. K/min, 240. C @ 7. min; Tstart: 60. C
CapillaryHP-5MS1449.Shang, Hu, et al., 200230. m/0.25 mm/0.25 μm, He, 50. C @ 2. min, 5. K/min, 250. C @ 5. min

Normal alkane RI, non-polar column, temperature ramp

View large format table.

Column type Active phase I Reference Comment
CapillaryDB-51433.Yousefzadi, Heidari, et al., 2011Nitrogen, 60. C @ 1. min, 4. K/min, 250. C @ 10. min; Column length: 30. m; Column diameter: 0.25 mm
CapillaryZB-5 MS1411.Boix, Victorio, et al., 201030. m/0.25 mm/0.25 μm, Helium, 5. K/min; Tstart: 60. C; Tend: 290. C
CapillaryOV-11406.Hu, Liang, et al., 201030. m/0.25 mm/0.25 μm, Helium, 50. C @ 3. min, 5. K/min, 250. C @ 2. min
CapillaryDB-11393.Pala-Paul J., Perez-Alonso M.J., et al., 200650. m/0.25 mm/0.25 μm, N2, 4. K/min; Tstart: 95. C; Tend: 240. C
CapillaryDB-5MS1380.Marongiu, Piras, et al., 200530. m/0.25 mm/0.25 μm, He, 60. C @ 30. min, 3. K/min; Tend: 280. C
CapillaryHP-5MS1399.Slavkovska, Couladis, et al., 200530. m/0.25 mm/0.25 μm, He, 3. K/min; Tstart: 60. C; Tend: 280. C
CapillaryDB-5MS1373.Marongiu, Porcedda, et al., 200430. m/0.25 mm/0.25 μm, He, 3. K/min, 280. C @ 30. min; Tstart: 60. C
CapillaryHP-51381.Pitarokili, Tzakou, et al., 200330. m/0.25 mm/0.25 μm, He, 3. K/min; Tstart: 60. C; Tend: 280. C
CapillaryHP-51446.Benevides, Young, et al., 200230. m/0.20 mm/0.33 μm, 3. K/min, 290. C @ 10. min; Tstart: 60. C
CapillaryDB-11382.Palá-Paúl, Pérez-Alonso, et al., 200250. m/0.25 mm/0.25 μm, N2, 4. K/min; Tstart: 80. C; Tend: 225. C
CapillaryHP-5 MS1449.Shang, Hu, et al., 200130. m/0.25 mm/0.25 μm, Helium, 50. C @ 2. min, 5. K/min, 250. C @ 5. min

Normal alkane RI, non-polar column, custom temperature program

View large format table.

Column type Active phase I Reference Comment
CapillaryDB-51413.Nezhadali and Parsa, 201030. m/0.20 mm/0.32 μm, Helium; Program: 60 0C (1 min) 3 0C/min -> 140 0C 50 0C/min -> 250 0C (3 min)
CapillaryHP-5MS1422.Deng, Li, et al., 200430. m/0.25 mm/0.25 μm, He; Program: 60C => 10C/min => 160C => 12C/min => 300C (5min)
CapillaryOV-11378.Hafez and Abdel-Salam, 200430. m/0.25 mm/0.25 μm, He; Program: 45 0C (4 min) 3 0C/min -> 75 0C 4 0C/min -> 115 0C 6 0C/min -> 312 0C
CapillaryHP-5 MS1446.Shang, Hu, et al., 200130. m/0.25 mm/0.25 μm, Helium; Program: not specified

References

Pang T., Zhu S., et al., 2007
Pang T.; Zhu S.; Lu X.; Xu G., Identification of unknown compounds on the basis of retention index data in comprehensive two-dimensional gas chromatography, J. Sep. Sci., 2007, 30, 6, 868-874, https://doi.org/10.1002/jssc.200600471 . [all data]

Sartoratto, Machado, et al., 2004
Sartoratto, A.; Machado, A.L.M.; Delarmelina, C.; Figueira, G.M.; Duarte, M.C.T.; Rehder, V.L.G., Composition and antimicrobial activity of essential oils from aromatic plants used in Brazil, Braz. J. Microbiol., 2004, 35, 4, 275-280, https://doi.org/10.1590/S1517-83822004000300001 . [all data]

Shang, Hu, et al., 2002
Shang, C.; Hu, Y.; Deng, C.; Hu, K., Rapid determination of volatile constituents of Michelia alba flowers by gas chromatography-mass spectrometry with solid-phase microextraction, J. Chromatogr. A, 2002, 942, 1-2, 283-288, https://doi.org/10.1016/S0021-9673(01)01382-6 . [all data]

Yousefzadi, Heidari, et al., 2011
Yousefzadi, M.; Heidari, M.; Akbarpour, M.; Mirjalili, M.H.; Zainali, A.; Parsa, M., in vitro cytotoxic activity of the essential oil of Dorema ammoniacum D. Don., Middle-East J. Sci. Res., 2011, 7, 4, 511-514. [all data]

Boix, Victorio, et al., 2010
Boix, V.F.; Victorio, C.P.; Lage, C.L.S.; Kuster, R.M., Volatile compounds from Rosmarinus officinalis L. and Baccharis dracunculifolia DC. growing in Southeast coast of Brasil, Quim. Nova, 2010, 33, 2, 255-257, https://doi.org/10.1590/S0100-40422010000200004 . [all data]

Hu, Liang, et al., 2010
Hu, C.-D.; Liang, Y.-Z.; Guo, F.-Q.; Li, X.-R.; Wang, W.-P., Determination of essential oil composition from Osmanthus fragrans tea by GC-MS combined with a chemometric resolution method, Molecules, 2010, 15, 5, 3683-3693, https://doi.org/10.3390/molecules15053683 . [all data]

Pala-Paul J., Perez-Alonso M.J., et al., 2006
Pala-Paul J.; Perez-Alonso M.J.; Velasco-Negueruela A.; Ballesteros M.T.; Sanz J., Essential oil composition of Sideritis hirsuta L. from Guadalajara Province, Spain, Flavour Fragr. J., 2006, 21, 3, 410-415, https://doi.org/10.1002/ffj.1727 . [all data]

Marongiu, Piras, et al., 2005
Marongiu, B.; Piras, A.; Porcedda, S.; Scorciapino, A., Chemical composition of the essential oil and supercritical CO2 extract of Commiphora myrrha (Nees) Engl. and of Acorus calamus L., J. Agric. Food Chem., 2005, 53, 20, 7939-7943, https://doi.org/10.1021/jf051100x . [all data]

Slavkovska, Couladis, et al., 2005
Slavkovska, V.; Couladis, M.; Bojovic, S.; Tzakou, O.; Pavlovic, M.; Lakusic, B.; Jancic, R., Essential oil and its systematic significance in species of Micromeria Bentham from Serbia Montenegro, Plant Systematics and Evolution, 2005, 255, 1-2, 1-15, https://doi.org/10.1007/s00606-005-0303-y . [all data]

Marongiu, Porcedda, et al., 2004
Marongiu, B.; Porcedda, A.P.S.; Casu, R.; Pierucci, P., Chemical composition of the oil and supercritical CO2 extract of Schinus molle L., Flavour Fragr. J., 2004, 19, 6, 554-558, https://doi.org/10.1002/ffj.1350 . [all data]

Pitarokili, Tzakou, et al., 2003
Pitarokili, D.; Tzakou, O.; Loukis, A.; Harvala, C., Volatile metabolites from Salvia fruticosa as antifungal agents in soilborne pathogens, J. Agric. Food Chem., 2003, 51, 11, 3294-3301, https://doi.org/10.1021/jf0211534 . [all data]

Benevides, Young, et al., 2002
Benevides, P.J.C.; Young, M.C.M.; Bolzani, V.S., Composição química e atevidade antifúngica do óleo essencial de psychotria spectabillis L. (Rubiaceae), 2002, retrieved from http://www.sbq.org.br/ranteriores/23/resumos/0131. [all data]

Palá-Paúl, Pérez-Alonso, et al., 2002
Palá-Paúl, J.; Pérez-Alonso, M.J.; Velasco-Negueruela, A.; Sanz, J., Analysis by gas chromatography-mass spectrometry of the volatile components of Ageratina adenophora Spreng., growing in the Canary Islands, J. Chromatogr. A, 2002, 947, 2, 327-331, https://doi.org/10.1016/S0021-9673(02)00016-X . [all data]

Shang, Hu, et al., 2001
Shang, C.; Hu, Y.; Deng, C.; Hu, K., Rapid determination of volatile constituents of Michelia alba flowers by gas chromatography - mass spectrometry with solid-phase microextraction, J. Chromatogr. A, 2001, 942, 1-2, 283-288, https://doi.org/10.1016/S0021-9673(01)01382-6 . [all data]

Nezhadali and Parsa, 2010
Nezhadali, A.; Parsa, M., Study of the volatile compounds in Artemisia Sagebrush from Iran using HS/SPME/GC/MS, Int. J. Environ. Sci. Development, 2010, 1, 3, 287-289, https://doi.org/10.7763/IJESD.2010.V1.56 . [all data]

Deng, Li, et al., 2004
Deng, C.; Li, N.; Zhang, X., Rapid determination of essential oil in Acorus tatarinowii Schott. by pressurized hot water extraction followed by solid-phase microextraction and gas chromatography-mass spectrometry, J. Chromatogr. A, 2004, 1059, 1-2, 149-155, https://doi.org/10.1016/j.chroma.2004.10.005 . [all data]

Hafez and Abdel-Salam, 2004
Hafez, S.S.; Abdel-Salam, H.A., chemical composition and antimicrobial activity of the volatile constituents of thuja occidentalis L. growing in Egipt, Alexandria J. Pharm. Sci., 2004, 18, 1, 41-47. [all data]