diacetyl peroxide
- Formula: C4H6O4
- Molecular weight: 118.0880
- IUPAC Standard InChIKey: ZQMIGQNCOMNODD-UHFFFAOYSA-N
- CAS Registry Number: 110-22-5
- Chemical structure:
View 3d structure (requires JavaScript / HTML 5) - Permanent link for this species. Use this link for bookmarking this species for future reference.

Gas phase thermochemistry data

Data compiled by: Glushko Thermocenter, Russian Academy of Sciences, Moscow
Constant pressure heat capacity of gas
Cp,gas (J/mol*K) | Temperature (K) | Reference | Comment |
---|---|---|---|
54.93 | 50. | Dorofeeva O.V., 1997 | p=1 bar. |
77.24 | 100. | ||
93.17 | 150. | ||
107.95 | 200. | ||
136. ± 5. | 298.15 | ||
136.45 | 300. | ||
163.04 | 400. | ||
186.36 | 500. | ||
206.09 | 600. | ||
222.66 | 700. | ||
236.62 | 800. | ||
248.43 | 900. | ||
258.47 | 1000. | ||
267.03 | 1100. | ||
274.36 | 1200. | ||
280.64 | 1300. | ||
286.05 | 1400. | ||
290.72 | 1500. |

Condensed phase thermochemistry data

Data compiled by: Hussein Y. Afeefy, Joel F. Liebman, and Stephen E. Stein
Quantity | Value | Units | Method | Reference | Comment |
---|---|---|---|---|---|
ΔfH°liquid | -535. ± 10. | kJ/mol | Ccb | Jaffe, Prosen, et al., 1957 | |
Quantity | Value | Units | Method | Reference | Comment |
ΔcH°liquid | -1896.4 ± 9.2 | kJ/mol | Ccb | Jaffe, Prosen, et al., 1957 | Corresponding ΔfHºliquid = -535.1 kJ/mol (simple calculation by NIST; no Washburn corrections) |

Phase change data

Data compiled by: Robert L. Brown and Stephen E. Stein
Reduced pressure boiling point
Tboil (K) | Pressure (bar) | Reference |
---|---|---|
336.2 | 0.028 | Weast and Grasselli, 1989 |

References

Dorofeeva O.V., 1997
Dorofeeva O.V.,
Unpublished results. Thermocenter of Russian Academy of Science, Moscow, 1997. [all data]
Jaffe, Prosen, et al., 1957
Jaffe, L.; Prosen, E.J.; Szwarc, M.,
Heats of combustion of some peroxides and the heats of formation of acetate, propionate, and butyrate radicals,
J. Chem. Phys., 1957, 27, 416-420. [all data]
Weast and Grasselli, 1989
CRC Handbook of Data on Organic Compounds, 2nd Editon, Weast,R.C and Grasselli, J.G., ed(s)., CRC Press, Inc., Boca Raton, FL, 1989, 1. [all data]