Butanediamide
- Formula: C4H8N2O2
- Molecular weight: 116.1185
- IUPAC Standard InChIKey: SNCZNSNPXMPCGN-UHFFFAOYSA-N
- CAS Registry Number: 110-14-5
- Chemical structure:

Reaction thermochemistry data

Data compiled by: Robert C. Dunbar
Individual Reactions
By formula: Na+ + C4H8N2O2 = (Na+ • C4H8N2O2)
Quantity | Value | Units | Method | Reference | Comment |
---|---|---|---|---|---|
ΔrH° | 44.5 | kcal/mol | CIDT | Klassen, Anderson, et al., 1996 |

Gas phase ion energetics data

Data compiled by: Michael M. Meot-Ner (Mautner)
Proton affinity at 298K
Proton affinity (kcal/mol) | Reference |
---|---|
225. | Witt and Grutzmacher, 2000 |
Protonation entropy at 298K
Protonation entropy (cal/mol*K) | Reference |
---|---|
-4.5 | Witt and Grutzmacher, 2000 |

Ion clustering data

Data compiled by: Robert C. Dunbar
Clustering reactions
By formula: Na+ + C4H8N2O2 = (Na+ • C4H8N2O2)
Quantity | Value | Units | Method | Reference | Comment |
---|---|---|---|---|---|
ΔrH° | 44.5 | kcal/mol | CIDT | Klassen, Anderson, et al., 1996 |

References

Klassen, Anderson, et al., 1996
Klassen, J.S.; Anderson, S.G.; Blades, A.T.; Kebarle, P.,
Reaction Enthalpies for M+L = M+ + L, Where M+ = Na+ and K+ and L = Acetamide, N-Methylacetamide, N,N-Dimethylacetamide, Glycine, and Glycylglycine, from Determinations of the Collision-Induced Dissociation Thresholds,
J. Phys. Chem., 1996, 100, 33, 14218, https://doi.org/10.1021/jp9608382
. [all data]
Witt and Grutzmacher, 2000
Witt, M.; Grutzmacher, H.F.,
Effects of internal hydrogen bonds between amide groups: Gas-phase basicity and proton affinity of linear aliphatic dicarboxamides,
European J. Mass Spectrom., 2000, 6, 97. [all data]