2,5-Hexanedione
- Formula: C6H10O2
- Molecular weight: 114.1424
- IUPAC Standard InChIKey: OJVAMHKKJGICOG-UHFFFAOYSA-N
- CAS Registry Number: 110-13-4
- Chemical structure:
View 3d structure (requires JavaScript / HTML 5) - Other names: α,β-Diacetylethane; Acetonyl acetone; Diacetonyl; 1,2-Diacetylethane; 2,5-Hexadione; Hexane-2,5-dione; Hexanedione-(2,5); Acetone, acetonyl-; HDO; 2,5-Diketohexane; CH3COCH2CH2COCH3; 2,5-Dioxohexane; NSC 7621

Phase change data

Data compiled as indicated in comments:
TRC - Thermodynamics Research Center, NIST Boulder Laboratories, Chris Muzny director
BS - Robert L. Brown and Stephen E. Stein
AC - William E. Acree, Jr., James S. Chickos
Quantity | Value | Units | Method | Reference | Comment |
---|---|---|---|---|---|
Tboil | 467.15 | K | N/A | Sabatier and Mailhe, 1909 | Uncertainty assigned by TRC = 2. K; TRC |
Tboil | 467.15 | K | N/A | Sabatier and Mailhe, 1907 | Uncertainty assigned by TRC = 3. K; TRC |
Tboil | 463.4 | K | N/A | Perkin, 1884 | Uncertainty assigned by TRC = 1. K; TRC |
Reduced pressure boiling point
Tboil (K) | Pressure (bar) | Reference | Comment |
---|---|---|---|
343.7 | 0.013 | Aldrich Chemical Company Inc., 1990 | BS |
Enthalpy of vaporization
ΔvapH (kJ/mol) | Temperature (K) | Method | Reference | Comment |
---|---|---|---|---|
50.1 | 401. | A | Stephenson and Malanowski, 1987 | Based on data from 386. to 474. K.; AC |

Gas phase ion energetics data

Data evaluated by: Edward P. Hunter and Sharon G. Lias
Quantity | Value | Units | Method | Reference | Comment |
---|---|---|---|---|---|
Proton affinity (review) | 892.0 | kJ/mol | N/A | Hunter and Lias, 1998 | |
Quantity | Value | Units | Method | Reference | Comment |
Gas basicity | 851.8 | kJ/mol | N/A | Hunter and Lias, 1998 |

Kovats' RI, non-polar column, isothermal

Column type | Active phase | Temperature (C) | I | Reference | Comment |
---|---|---|---|---|---|
Packed | SE-30 | 150. | 906. | Haken, Ho, et al., 1975 | Column length: 3.7 m |

Van Den Dool and Kratz RI, non-polar column, temperature ramp

Column type | Active phase | I | Reference | Comment |
---|---|---|---|---|
Capillary | DB-5 | 920. | Dallüge, van Stee, et al., 2002 | 30. m/0.25 mm/1. μm, He, 2.5 K/min; Tstart: 50. C; Tend: 200. C |

Van Den Dool and Kratz RI, polar column, temperature ramp

Column type | Active phase | I | Reference | Comment |
---|---|---|---|---|
Capillary | CP-WAX 57CB | 1485. | Baltes and Mevissen, 1988 | He, 50. C @ 5. min, 2. K/min; Column length: 50. m; Column diameter: 0.24 mm; Tend: 210. C |

Normal alkane RI, non-polar column, temperature ramp

Column type | Active phase | I | Reference | Comment |
---|---|---|---|---|
Capillary | HP-5 MS | 931. | Jerkovic and Marijanovic, 2010 | 30. m/0.25 mm/0.25 μm, Helium, 70. C @ 2. min, 3. K/min, 200. C @ 18. min |
Capillary | SLB-5MS | 932. | Risticevic, Carasek, et al., 2008 | 10. m/0.18 mm/0.18 μm, Helium, 40. C @ 1.5 min, 10. K/min; Tend: 295. C |
Capillary | SPB-5 | 925. | Poligné, Collignan, et al., 2001 | 60. m/0.32 mm/1. μm, He, 3. K/min; Tstart: 40. C; Tend: 200. C |
Capillary | DB-1 | 888. | Tai and Ho, 1998 | 60. m/0.32 mm/1.0 μm, He, 2. K/min; Tstart: 40. C; Tend: 280. C |

Normal alkane RI, non-polar column, custom temperature program

Column type | Active phase | I | Reference | Comment |
---|---|---|---|---|
Capillary | Siloxane, 5 % Ph | 918. | VOC BinBase, 2012 | Program: not specified |
Capillary | Polydimethyl siloxane, 5 % phenyl | 918. | Skogerson, Wohlgemuth, et al., 2011 | Program: not specified |
Capillary | Squalane | 906. | Chen, 2008 | Program: not specified |
Capillary | SE-30 | 894. | Vinogradov, 2004 | Program: not specified |
Capillary | SPB-1 | 890. | Flanagan, Streete, et al., 1997 | 60. m/0.53 mm/5. μm, He; Program: 40C(6min) => 5C/min => 80C => 10C/min => 200C |
Capillary | SPB-1 | 890. | Strete, Ruprah, et al., 1992 | 60. m/0.53 mm/5.0 μm, Helium; Program: 40 0C (6 min) 5 0C/min -> 80 0C 10 0C/min -> 200 0C |
Capillary | SPB-1 | 894. | Strete, Ruprah, et al., 1992 | 60. m/0.53 mm/5.0 μm, Helium; Program: not specified |
Capillary | OV-1 | 894. | Ramsey and Flanagan, 1982 | Program: not specified |

Normal alkane RI, polar column, temperature ramp

Column type | Active phase | I | Reference | Comment |
---|---|---|---|---|
Capillary | DB-Wax | 1515. | Karlsson, Birgersson, et al., 2009 | 30. m/0.25 mm/0.25 μm, Hydrogen, 30. C @ 5. min, 8. K/min, 230. C @ 10. min |
Capillary | DB-Wax | 1505. | Osada and Shibamoto, 2006 | He, 60. C @ 5. min, 2. K/min, 180. C @ 30. min; Column length: 30. m; Column diameter: 0.25 mm |

Normal alkane RI, polar column, custom temperature program

Column type | Active phase | I | Reference | Comment |
---|---|---|---|---|
Capillary | Carbowax 20M | 1500. | Vinogradov, 2004 | Program: not specified |
Capillary | Carbowax 20M | 1500. | Ramsey and Flanagan, 1982 | Program: not specified |

Lee's RI, non-polar column, custom temperature program

Column type | Active phase | I | Reference | Comment |
---|---|---|---|---|
Capillary | DB-5 | 135.5 | Fuentes, Font, et al., 2007 | Column length: 60. m; Program: not specified |

References

Sabatier and Mailhe, 1909
Sabatier, P.; Mailhe, A.,
New Applications of the General Method of Hydrogenation with Various Metals,
Ann. Chim. Phys., 1909, 16, 70. [all data]
Sabatier and Mailhe, 1907
Sabatier, P.; Mailhe, A.,
The Direct Hydrogenation of Methyl Diketones,
C. R. Hebd. Seances Acad. Sci., 1907, 144, 1086. [all data]
Perkin, 1884
Perkin, W.H.,
On the Magnetic Rotary Polarisation of Compounds in Relation to their Chemical Consitution; with Observations on the Preparation and Relative Densities of the Bodies Examined,
J. Chem. Soc., 1884, 45, 421-580. [all data]
Aldrich Chemical Company Inc., 1990
Aldrich Chemical Company Inc.,
Catalog Handbook of Fine Chemicals, Aldrich Chemical Company, Inc., Milwaukee WI, 1990, 1. [all data]
Stephenson and Malanowski, 1987
Stephenson, Richard M.; Malanowski, Stanislaw,
Handbook of the Thermodynamics of Organic Compounds, 1987, https://doi.org/10.1007/978-94-009-3173-2
. [all data]
Hunter and Lias, 1998
Hunter, E.P.; Lias, S.G.,
Evaluated Gas Phase Basicities and Proton Affinities of Molecules: An Update,
J. Phys. Chem. Ref. Data, 1998, 27, 3, 413-656, https://doi.org/10.1063/1.556018
. [all data]
Haken, Ho, et al., 1975
Haken, J.K.; Ho, D.K.M.; Vaughan, C.E.,
Gas chromatography of homologous esters. VII. The retention behaviour of pyruvate esters and related carbonyl and carboxyl compounds,
J. Chromatogr., 1975, 106, 2, 317-325, https://doi.org/10.1016/S0021-9673(00)93839-1
. [all data]
Dallüge, van Stee, et al., 2002
Dallüge, J.; van Stee, L.L.P.; Xu, X.; Williams, J.; Beens, J.; Vreuls, R.J.J.; Brinkman, U.A.Th.,
Unravelling the composition of very complex samples by comprehensive gas chromatography coupled to time-of-flight mass spectrometry. Cigarette smoke,
J. Chromatogr. A, 2002, 974, 1-2, 169-184, https://doi.org/10.1016/S0021-9673(02)01384-5
. [all data]
Baltes and Mevissen, 1988
Baltes, W.; Mevissen, L.,
Model reactions on roast aroma formation. VI. Volatile reaction products from the reaction of phenylalanine with glucose during cooking and roasting,
Z. Lebensm. Unters. Forsch., 1988, 187, 3, 209-214, https://doi.org/10.1007/BF01043341
. [all data]
Jerkovic and Marijanovic, 2010
Jerkovic, I.; Marijanovic, Z.,
Oak (Quercus frainetto Ten.) honeydaw honey - approach to screening of volatile organic composition and antioxidant capacity (DPPH and FRAP assay),
Molecules, 2010, 15, 5, 3744-3756, https://doi.org/10.3390/molecules15053744
. [all data]
Risticevic, Carasek, et al., 2008
Risticevic, S.; Carasek, E.; Pawliszyn, J.,
Headspace solid-phase microextraction-gas chromatographic-time-of-flight mass spectrometric methodology for geographical origin verification of coffee,
Anal. Chim. Acta, 2008, 617, 1-2, 72-84, https://doi.org/10.1016/j.aca.2008.04.009
. [all data]
Poligné, Collignan, et al., 2001
Poligné, I.; Collignan, A.; Trystram, G.,
Characterization of traditional processing of pork meat into boucané,
Meat Sci., 2001, 59, 4, 377-389, https://doi.org/10.1016/S0309-1740(01)00090-0
. [all data]
Tai and Ho, 1998
Tai, C.-Y.; Ho, C.-T.,
Influence of glutathione oxidation and pH on thermal formation of Maillard-type volatile compounds,
J. Agric. Food Chem., 1998, 46, 6, 2260-2265, https://doi.org/10.1021/jf971111t
. [all data]
VOC BinBase, 2012
VOC BinBase,
The volatile compound BinBase (VOC BinBase), 2012, retrieved from http://fiehnlab.ucdavis.edu/projects/VocBinBase and http://binbase.sourceforge.net. [all data]
Skogerson, Wohlgemuth, et al., 2011
Skogerson, K.; Wohlgemuth, G.; Fiehn, O.,
VocBinNase, 2011, retrieved from http://fiehnlab.ucdavis.edu/projects//VocBinBase. [all data]
Chen, 2008
Chen, H.-F.,
Quantitative prediction of gas chromatography retention indices with support vector machines, radial basis neutral networks and multiple linear regression,
Anal. Chim. Acta, 2008, 609, 1, 24-36, https://doi.org/10.1016/j.aca.2008.01.003
. [all data]
Vinogradov, 2004
Vinogradov, B.A.,
Production, composition, properties and application of essential oils, 2004, retrieved from http://viness.narod.ru. [all data]
Flanagan, Streete, et al., 1997
Flanagan, R.J.; Streete, P.J.; Ramsey, J.D.,
Volatile Substance Abuse, UNODC Technical Series, No 5, United Nations, Office on Drugs and Crime, Vienna International Centre, PO Box 500, A-1400 Vienna, Austria, 1997, 56, retrieved from http://www.odccp.org/pdf/technicalseries1997-01-011.pdf. [all data]
Strete, Ruprah, et al., 1992
Strete, P.J.; Ruprah, M.; Ramsey, J.D.; Flanagan, R.J.,
Detection and identification of volatile substances by headspace capillary gas chromatography to aid the diagnosis of acute poisoning,
Analyst, 1992, 117, 7, 1111-1127, https://doi.org/10.1039/an9921701111
. [all data]
Ramsey and Flanagan, 1982
Ramsey, J.D.; Flanagan, R.J.,
Detection and Identification of Volatile Organic Compounds in Blood by Headspace Gas Chromatography as an Aid to the Diagnosis of Solvent Abuse,
J. Chromatogr., 1982, 240, 2, 423-444, https://doi.org/10.1016/S0021-9673(00)99622-5
. [all data]
Karlsson, Birgersson, et al., 2009
Karlsson, M.F.; Birgersson, G.; Prado, A.M.C.; Bosa, F.; Bengtsson, M.; Witzgall, P.,
Plant Odor Analysis of Potato: Responce of Guatemalan Moth to Above- and Background Potato Volatiles,
J. Agric. Food Chem., 2009, 57, 13, 5903-5909, https://doi.org/10.1021/jf803730h
. [all data]
Osada and Shibamoto, 2006
Osada, Y.; Shibamoto, T.,
Antioxidative activity of volatile extracts from Maillard model systems,
Food Chem., 2006, 98, 3, 522-528, https://doi.org/10.1016/j.foodchem.2005.05.084
. [all data]
Fuentes, Font, et al., 2007
Fuentes, M.J.; Font, R.; Gomez-Rico, M.F.; Martin-Gullon, I.,
Pyrolysis and combustion of waste lubricant oil from diesel cars: Decomposition and pollutants,
J. Anal. Appl. Pyrolysis, 2007, 79, 1-2, 215-226, https://doi.org/10.1016/j.jaap.2006.12.004
. [all data]