2-Hexanone, 5-methyl-
- Formula: C7H14O
- Molecular weight: 114.1855
- IUPAC Standard InChIKey: FFWSICBKRCICMR-UHFFFAOYSA-N
- CAS Registry Number: 110-12-3
- Chemical structure:
View 3d structure (requires JavaScript / HTML 5) - Other names: Isoamyl methyl ketone; Isopentyl methyl ketone; Methyl isoamyl ketone; Methyl isopentyl ketone; MIAK; 2-Methyl-5-Hexanone; 5-Methyl-2-hexanone; (CH3)2CHCH2CH2COCH3; 5-Methylhexan-2-one; Ketone, methyl isoamyl; UN 2302; 3-Methylbutyl methyl ketone

Phase change data

Data compiled as indicated in comments:
BS - Robert L. Brown and Stephen E. Stein
TRC - Thermodynamics Research Center, NIST Boulder Laboratories, Chris Muzny director
Quantity | Value | Units | Method | Reference | Comment |
---|---|---|---|---|---|
Tboil | 414. ± 7. | K | AVG | N/A | Average of 13 values; Individual data points |
Quantity | Value | Units | Method | Reference | Comment |
Tfus | 199.3 | K | N/A | Anonymous, 1955 | Uncertainty assigned by TRC = 0.6 K; TRC |

Gas phase ion energetics data

Data compiled by: Sharon G. Lias, Rhoda D. Levin, and Sherif A. Kafafi
Ionization energy determinations
IE (eV) | Method | Reference |
---|---|---|
9.284 ± 0.005 | PE | Hernandez, Masclet, et al., 1977 |

Normal alkane RI, polar column, temperature ramp

Data compiled by: NIST Mass Spectrometry Data Center, William E. Wallace, director

Column type CapillaryCapillaryCapillaryCapillaryCapillary
Active phase HP-FFAPHP-InnowaxDB-WaxDB-WaxHP-FFAP
Column length (m) 25.60.30.30.25.
Carrier gas HeliumHelium  He
Substrate
Column diameter (mm) 0.320.250.250.250.32
Phase thickness (μm) 0.500.250.250.250.5
Tstart (C) 45.60.30.30.45.
Tend (C) 220.220.250.250.220.
Heat rate (K/min) 15.3.4.4.15.
Initial hold (min)  1.1.1.
Final hold (min)  5.
I 1154.1186.1141.1146.1154.
ReferenceWanakhachornkrai and Lertsiri, 9999Feng, Zhuang, et al., 2011Tanaka, Yamauchi, et al., 2003Tanaka, Yamauchi, et al., 2003Wanakhachornkrai and Lertsiri, 2003
Comment MSDC-RI MSDC-RI MSDC-RI MSDC-RI MSDC-RI
Column type Capillary
Active phase CP-Wax 52CB
Column length (m) 50.
Carrier gas H2
Substrate
Column diameter (mm) 0.32
Phase thickness (μm) 0.22
Tstart (C) 60.
Tend (C) 190.
Heat rate (K/min) 2.
Initial hold (min) 4.
Final hold (min) 21.
I 1140.
ReferenceHwan and Chou, 1999
Comment MSDC-RI

Van Den Dool and Kratz RI, polar column, temperature ramp

Data compiled by: NIST Mass Spectrometry Data Center, William E. Wallace, director

Column type CapillaryCapillaryCapillaryCapillary
Active phase ZB-WaxAT-WaxDB-WaxDB-Wax
Column length (m) 30.60.60.60.
Carrier gas HeHeHe
Substrate
Column diameter (mm) 0.250.320.250.25
Phase thickness (μm) 0.150.250.250.25
Tstart (C) 35.65.50.50.
Tend (C) 220.250.230.230.
Heat rate (K/min) 5.2.3.2.
Initial hold (min) 5.10.
Final hold (min) 10.60.
I 1142.1168.1190.1155.
ReferenceLedauphin, Basset, et al., 2006Pino, Almora, et al., 2003Shimoda, Peralta, et al., 1996Shimoda, Shigematsu, et al., 1995
Comment MSDC-RI MSDC-RI MSDC-RI MSDC-RI

Kovats' RI, non-polar column, isothermal

View large format table.

Column type Active phase Temperature (C) I Reference Comment
CapillaryOV-1333.836.5Hu, Lu, et al., 2006
CapillaryHP-1110.838.Héberger and Görgényi, 199950. m/0.32 mm/1.05 μm, N2
CapillaryHP-150.835.Héberger and Görgényi, 199950. m/0.32 mm/1.05 μm, N2
CapillaryHP-170.836.Héberger and Görgényi, 199950. m/0.32 mm/1.05 μm, N2
CapillaryHP-190.837.Héberger and Görgényi, 199950. m/0.32 mm/1.05 μm, N2
CapillarySPB-160.836.Castello, Vezzani, et al., 1991N2; Column length: 60. m; Column diameter: 0.75 mm

Kovats' RI, non-polar column, custom temperature program

View large format table.

Column type Active phase I Reference Comment
CapillaryBP-1819.Dwivedi, Khan, et al., 200425. m/0.25 mm/0.25 μm, N2; Program: 60C => 5C/min => 220C(5min) => 3C/min => 245C(5min)

Kovats' RI, polar column, isothermal

View large format table.

Column type Active phase Temperature (C) I Reference Comment
CapillaryHP-Innowax110.1172.1Héberger and Görgényi, 199930. m/0.32 mm/0.5 μm
CapillaryHP-Innowax50.1156.1Héberger and Görgényi, 199930. m/0.32 mm/0.5 μm
CapillaryHP-Innowax70.1160.9Héberger and Görgényi, 199930. m/0.32 mm/0.5 μm
CapillaryHP-Innowax90.1166.3Héberger and Görgényi, 199930. m/0.32 mm/0.5 μm
CapillarySupelcowax-1060.1150.Castello, Vezzani, et al., 1991N2; Column length: 60. m; Column diameter: 0.75 mm

Van Den Dool and Kratz RI, non-polar column, temperature ramp

View large format table.

Column type Active phase I Reference Comment
CapillaryHP-5857.Solina, Baumgartner, et al., 200525. m/0.2 mm/1. μm, He, 5. K/min, 280. C @ 5. min; Tstart: 40. C
CapillaryCP Sil 5 CB825.Pino, Almora, et al., 200360. m/0.32 mm/0.25 μm, He, 60. C @ 10. min, 3. K/min, 280. C @ 60. min
CapillaryDB-1830.9Sun and Stremple, 200330. m/0.25 mm/0.25 μm, He, 3. K/min; Tstart: 40. C; Tend: 325. C
CapillaryBPX-5862.Aaslyng, Elmore, et al., 199850. m/0.32 mm/0.50 μm, He, 4. K/min; Tstart: 40. C; Tend: 280. C

Van Den Dool and Kratz RI, non-polar column, custom temperature program

View large format table.

Column type Active phase I Reference Comment
CapillaryBPX-5862.Owens J.D., Allagheny N., et al., 199750. m/0.32 mm/0.5 μm, He; Program: OC => 60C/min => 60C(5min) => 4C/min => 250C(20min)

Normal alkane RI, non-polar column, isothermal

View large format table.

Column type Active phase Temperature (C) I Reference Comment
CapillaryOV-160.835.Amboni, Junkes, et al., 2002

Normal alkane RI, non-polar column, temperature ramp

View large format table.

Column type Active phase I Reference Comment
CapillaryDB-1832.Xu, Tang, et al., 201030. m/0.25 mm/0.25 μm, Helium, 50. C @ 2. min, 4. K/min, 220. C @ 2. min
CapillaryOV-101825.Anker, Jurs, et al., 19902. K/min; Column length: 50. m; Column diameter: 0.28 mm; Tstart: 80. C; Tend: 200. C
CapillaryDB-1832.Flath, Matsumoto, et al., 198960. m/0.32 mm/0.25 μm, 4. K/min; Tstart: 50. C; Tend: 250. C
CapillaryDB-1832.Flath, Matsumoto, et al., 198960. m/0.32 mm/0.25 μm, 4. K/min; Tstart: 50. C; Tend: 250. C
CapillaryDB-1832.Flath, Matsumoto, et al., 198960. m/0.32 mm/0.25 μm, 4. K/min; Tstart: 50. C; Tend: 250. C
CapillaryDB-1835.Flath, Matsumoto, et al., 198960. m/0.32 mm/0.25 μm, 4. K/min; Tstart: 50. C; Tend: 250. C
CapillaryOV-101865.Stern, Flath, et al., 198550. C @ 0.1 min, 4. K/min, 225. C @ 30. min; Column length: 50. m; Column diameter: 0.32 mm

Normal alkane RI, non-polar column, custom temperature program

View large format table.

Column type Active phase I Reference Comment
CapillaryDB-1831.Xu, Tang, et al., 201030. m/0.25 mm/0.25 μm, Helium; Program: not specified
CapillaryMethyl Silicone836.Feng and Mu, 2007Program: not specified
CapillaryMethyl Silicone839.Blunden, Aneja, et al., 200560. m/0.32 mm/1.0 μm, Helium; Program: -50 0C (2 min) 8 0C/min -> 200 0C (7.75 min) 25 0C -> 225 0C (8 min)
CapillaryHP-1835.Junkes, Amboni, et al., 2004Program: not specified
CapillarySE-30825.Vinogradov, 2004Program: not specified
CapillaryPolydimethyl siloxane835.Junkes, Castanho, et al., 2003Program: not specified
CapillaryMethyl Silicone836.Estrada and Gutierrez, 1999Program: not specified
CapillaryPolydimethyl siloxanes828.Zenkevich and Chupalov, 1996Program: not specified

Normal alkane RI, polar column, custom temperature program

View large format table.

Column type Active phase I Reference Comment
CapillaryHP-Innowax1188.Feng, Zhuang, et al., 201160. m/0.25 mm/0.25 μm, Helium; Program: not specified
CapillaryInnowax1156.Junkes, Amboni, et al., 2004Program: not specified

References

Anonymous, 1955
Anonymous, R.,
, Am. Pet. Inst. Res. Proj. 45, Tech. Rep. 14, No. 1, Ohio State Univ., 1955. [all data]