2-Pyrazoline
- Formula: C3H6N2
- Molecular weight: 70.0931
- IUPAC Standard InChIKey: MCGBIXXDQFWVDW-UHFFFAOYSA-N
- CAS Registry Number: 109-98-8
- Chemical structure:
View 3d structure (requires JavaScript / HTML 5) - Other names: 4,5-dihydro-1H-pyrazole

Normal alkane RI, non-polar column, custom temperature program

Column type | Active phase | I | Reference | Comment |
---|---|---|---|---|
Capillary | Methyl Silicone | 771. | Zenkevich, 1996 | Program: not specified |

References

Zenkevich, 1996
Zenkevich, I.G.,
Informational Maitenance of Gas Chromatographic Identification of Organic Compounds in Ecoanalytical Investigations,
Z. Anal. Chem., 1996, 51, 11, 1140-1148. [all data]