1H-Pyrrole, 2,5-dihydro-
- Formula: C4H7N
- Molecular weight: 69.1051
- IUPAC Standard InChIKey: JVQIKJMSUIMUDI-UHFFFAOYSA-N
- CAS Registry Number: 109-96-6
- Chemical structure:
View 3d structure (requires JavaScript / HTML 5) - Other names: 3-Pyrroline; δ3-Pyrroline; 2,5-Dihydropyrrole; Pyrroline; 2,5-Dihydro-1H-pyrrole; 2,5-dihydro-H-pyrrole

Phase change data

Data compiled as indicated in comments:
BS - Robert L. Brown and Stephen E. Stein
TRC - Thermodynamics Research Center, NIST Boulder Laboratories, Chris Muzny director
Quantity | Value | Units | Method | Reference | Comment |
---|---|---|---|---|---|
Tboil | 363.7 | K | N/A | Weast and Grasselli, 1989 | BS |
Tboil | 363.65 | K | N/A | Robles, 1939 | Uncertainty assigned by TRC = 1.5 K; TRC |
Reduced pressure boiling point
Tboil (K) | Pressure (bar) | Reference | Comment |
---|---|---|---|
363.7 | 0.997 | Aldrich Chemical Company Inc., 1990 | BS |

Gas phase ion energetics data

Data compiled by: Sharon G. Lias, Rhoda D. Levin, and Sherif A. Kafafi
Ionization energy determinations
IE (eV) | Method | Reference | Comment |
---|---|---|---|
8.0 | PE | Morishima, Yoshikawa, et al., 1975 | |
8.61 ± 0.05 | PE | Morishima, Yoshikawa, et al., 1975 | Vertical value |

References

Weast and Grasselli, 1989
CRC Handbook of Data on Organic Compounds, 2nd Editon, Weast,R.C and Grasselli, J.G., ed(s)., CRC Press, Inc., Boca Raton, FL, 1989, 1. [all data]
Robles, 1939
Robles, H. deV.,
The Preparation and Dipole Moments of Heterocyclic Five-Membered Rings with One Heterocyclic Atom,
Recl. Trav. Chim. Pays-Bas, 1939, 58, 111. [all data]
Aldrich Chemical Company Inc., 1990
Aldrich Chemical Company Inc.,
Catalog Handbook of Fine Chemicals, Aldrich Chemical Company, Inc., Milwaukee WI, 1990, 1. [all data]