1,3-Propanediamine
- Formula: C3H10N2
- Molecular weight: 74.1249
- IUPAC Standard InChIKey: XFNJVJPLKCPIBV-UHFFFAOYSA-N
- CAS Registry Number: 109-76-2
- Chemical structure:
View 3d structure (requires JavaScript / HTML 5) - Other names: Propane-1,3-diamine; Trimethylenediamine; 1,3-Diaminopropane; 1,3-Propylenediamine; H2N(CH2)3NH2

Phase change data

Data compiled as indicated in comments:
BS - Robert L. Brown and Stephen E. Stein
TRC - Thermodynamics Research Center, NIST Boulder Laboratories, Chris Muzny director
AC - William E. Acree, Jr., James S. Chickos
ALS - Hussein Y. Afeefy, Joel F. Liebman, and Stephen E. Stein
Quantity | Value | Units | Method | Reference | Comment |
---|---|---|---|---|---|
Tboil | 413.2 | K | N/A | Aldrich Chemical Company Inc., 1990 | BS |
Tboil | 412.9 | K | N/A | Majer and Svoboda, 1985 | |
Quantity | Value | Units | Method | Reference | Comment |
Tfus | 261.2 | K | N/A | Anonymous, 1958 | Uncertainty assigned by TRC = 0.6 K; TRC |
Tfus | 249.65 | K | N/A | Timmermans and Mattaar, 1921 | Uncertainty assigned by TRC = 0.5 K; TRC |
Quantity | Value | Units | Method | Reference | Comment |
ΔvapH° | 50.18 | kJ/mol | N/A | Majer and Svoboda, 1985 | |
ΔvapH° | 50.2 ± 0.1 | kJ/mol | C | Wadsö, Heikkilä, et al., 1969 | AC |
ΔvapH° | 50.16 ± 0.10 | kJ/mol | C | Wadso, 1969 | ALS |
Enthalpy of vaporization
ΔvapH (kJ/mol) | Temperature (K) | Reference |
---|---|---|
40.85 | 412.9 | Majer and Svoboda, 1985 |
Enthalpy of fusion
ΔfusH (kJ/mol) | Temperature (K) | Method | Reference | Comment |
---|---|---|---|---|
12.19 | 262.4 | DSC | Dall'Acqua, Della Gatta, et al., 2002 | AC |

Reaction thermochemistry data

Data compiled by: Michael M. Meot-Ner (Mautner) and Sharon G. Lias
Individual Reactions
(C3H11N2+ • 2) +
= (C3H11N2+ • 3
)
By formula: (C3H11N2+ • 2C3H10N2) + C3H10N2 = (C3H11N2+ • 3C3H10N2)
Quantity | Value | Units | Method | Reference | Comment |
---|---|---|---|---|---|
ΔrH° | 82.4 | kJ/mol | HPMS | Wincel and Herman, 1973 | gas phase; Entropy change is questionable |
Quantity | Value | Units | Method | Reference | Comment |
ΔrS° | 238. | J/mol*K | HPMS | Wincel and Herman, 1973 | gas phase; Entropy change is questionable |

Gas phase ion energetics data

Data evaluated as indicated in comments:
HL - Edward P. Hunter and Sharon G. Lias
Data compiled as indicated in comments:
MM - Michael M. Meot-Ner (Mautner)
Quantity | Value | Units | Method | Reference | Comment |
---|---|---|---|---|---|
Proton affinity (review) | 987.0 | kJ/mol | N/A | Hunter and Lias, 1998 | HL |
Quantity | Value | Units | Method | Reference | Comment |
Gas basicity | 940.0 | kJ/mol | N/A | Hunter and Lias, 1998 | HL |
Proton affinity at 298K
Proton affinity (kJ/mol) | Reference | Comment |
---|---|---|
978. ± 4. | Hahn and Wesdemiotis, 2003 | MM |
970.7 | Wang, Chu, et al., 1999 | KM results obtained from CID of complexes with secondary amines at E(cm) = 0 eV, extrapolated from CID at E(cm) = 0.8, 1.5, 2.0 eV; MM |
982.4 | Wang, Chu, et al., 1999 | KM results obtained from CID of complexes with secondary amines using Fenselau/Wesdemiotis correction; MM |

Ion clustering data

Data compiled by: Michael M. Meot-Ner (Mautner) and Sharon G. Lias
Clustering reactions
(C3H11N2+ • 2) +
= (C3H11N2+ • 3
)
By formula: (C3H11N2+ • 2C3H10N2) + C3H10N2 = (C3H11N2+ • 3C3H10N2)
Quantity | Value | Units | Method | Reference | Comment |
---|---|---|---|---|---|
ΔrH° | 82.4 | kJ/mol | HPMS | Wincel and Herman, 1973 | gas phase; Entropy change is questionable |
Quantity | Value | Units | Method | Reference | Comment |
ΔrS° | 238. | J/mol*K | HPMS | Wincel and Herman, 1973 | gas phase; Entropy change is questionable |

Kovats' RI, polar column, isothermal

Column type | Active phase | Temperature (C) | I | Reference | Comment |
---|---|---|---|---|---|
Packed | PEG-2000 | 179. | 1330. | Anderson, Jurel, et al., 1973 | He, Celite 545 (44-60 mesh); Column length: 3. m |
Packed | PEG-2000 | 200. | 1320. | Anderson, Jurel, et al., 1973 | He, Celite 545 (44-60 mesh); Column length: 3. m |

Van Den Dool and Kratz RI, non-polar column, custom temperature program

Column type | Active phase | I | Reference | Comment |
---|---|---|---|---|
Capillary | DB-1 | 748. | Peng, 2000 | 15. m/0.53 mm/1. μm, He; Program: 40C(3min) => 8C/min => 200(1min) => 5C/min => 300C(25min) |

Van Den Dool and Kratz RI, polar column, temperature ramp

Column type | Active phase | I | Reference | Comment |
---|---|---|---|---|
Capillary | HP-Wax | 1337. | Peng, 2000 | 15. m/0.53 mm/1. μm, He, 40. C @ 3. min, 5. K/min, 220. C @ 30. min |

Normal alkane RI, non-polar column, custom temperature program

Column type | Active phase | I | Reference | Comment |
---|---|---|---|---|
Capillary | OV-101 | 720. | Zenkevich and Malamakhov, 1987 | He; Column length: 50. m; Column diameter: 0.24 mm; Program: not specified |

References

Aldrich Chemical Company Inc., 1990
Aldrich Chemical Company Inc.,
Catalog Handbook of Fine Chemicals, Aldrich Chemical Company, Inc., Milwaukee WI, 1990, 1. [all data]
Majer and Svoboda, 1985
Majer, V.; Svoboda, V.,
Enthalpies of Vaporization of Organic Compounds: A Critical Review and Data Compilation, Blackwell Scientific Publications, Oxford, 1985, 300. [all data]
Anonymous, 1958
Anonymous, R.,
, Am. Pet. Inst. Res. Proj. 45, Ohio State Univ., 1958. [all data]
Timmermans and Mattaar, 1921
Timmermans, J.; Mattaar, J.F.,
Freezing points of orgainic substances VI. New experimental determinations.,
Bull. Soc. Chim. Belg., 1921, 30, 213. [all data]
Wadsö, Heikkilä, et al., 1969
Wadsö, Ingemar; Heikkilä, Jussi; Beagley, B.; Aalto, Tarja; Werner, Per-Erik; Junggren, Ulf; Lamm, Bo; Samuelsson, Benny,
Enthalpies of Vaporization of Organic Compounds. III. Amines.,
Acta Chem. Scand., 1969, 23, 2061-2064, https://doi.org/10.3891/acta.chem.scand.23-2061
. [all data]
Wadso, 1969
Wadso, I.,
Enthalpies of vaporization of organic compounds,
Acta Chem. Scand., 1969, 23, 2061. [all data]
Dall'Acqua, Della Gatta, et al., 2002
Dall'Acqua, Lorenzo; Della Gatta, Giuseppe; Nowicka, Bozenna; Ferloni, Paolo,
Enthalpies and entropies of fusion of ten alkane-α, ω-diamines H2 N-- (CH 2)n-- NH2 where 3≤n≤12,
The Journal of Chemical Thermodynamics, 2002, 34, 1, 1-12, https://doi.org/10.1006/jcht.2001.0950
. [all data]
Wincel and Herman, 1973
Wincel, H.; Herman, J.A.,
Photoionization Study of Clustering Reactions in Diamines: Ethane-1,2-diamine, Propane-1,2-diamine and Propane-1,3-diamine,
J. Chem. Soc. Faraday Trans., 1973, 69, 1797, https://doi.org/10.1039/f19736901797
. [all data]
Hunter and Lias, 1998
Hunter, E.P.; Lias, S.G.,
Evaluated Gas Phase Basicities and Proton Affinities of Molecules: An Update,
J. Phys. Chem. Ref. Data, 1998, 27, 3, 413-656, https://doi.org/10.1063/1.556018
. [all data]
Hahn and Wesdemiotis, 2003
Hahn, I.S.; Wesdemiotis, C.,
Protonation Thermochemistry of beta-Alanine. An Evaluation of Proton Affinities and Entropies Determined by the Extended Kinetic Method,
Int. J. Mass Spectrometry, 2003, 222, 465. [all data]
Wang, Chu, et al., 1999
Wang, Z.; Chu, I.K.; Rodriquez, C.F.; Hopkinson, A.C.; Siu, K.W.M.,
α,ω-Diaminoalkanes as models for bases that dicoordinate the proton: An evaluation of the kinetic method for estimating their proton affinities,
J. Phys. Chem. A., 1999, 103, 8700. [all data]
Anderson, Jurel, et al., 1973
Anderson, A.; Jurel, S.; Shymanska, M.; Golender, L.,
Gas-liquid chromatography of some aliphatic and heterocyclic mono- and pollyfunctional amines. VII. Retention indices of amines in some polar and unpolar stationary phases,
Latv. PSR Zinat. Akad. Vestis Kim. Ser., 1973, 1, 51-63. [all data]
Peng, 2000
Peng, C.T.,
Prediction of retention indices. V. Influence of electronic effects and column polarity on retention index,
J. Chromatogr. A, 2000, 903, 1-2, 117-143, https://doi.org/10.1016/S0021-9673(00)00901-8
. [all data]
Zenkevich and Malamakhov, 1987
Zenkevich, I.G.; Malamakhov, A.C.,
Evaluation of Molecular Weights of Organic Compounds based on Retention Parameters at Chromato-Spectral Analysys. Additional Criterion of Molecular Ions' Identification,
Vestn. St. Petersb. Univ. Ser. 4: Fiz. Khim, 1987, 2, 101-106. [all data]