butyllithium
- Formula: C4H9Li
- Molecular weight: 64.055
- CAS Registry Number: 109-72-8

Gas phase thermochemistry data

Data compiled by: José A. Martinho Simões
Quantity | Value | Units | Method | Reference | Comment |
---|---|---|---|---|---|
ΔfH°gas | -2.4 ± 4.3 | kJ/mol | Review | Martinho Simões | Selected data. |
ΔfH°gas | -21.5 ± 4.2 | kJ/mol | Review | Martinho Simões | |
ΔfH°gas | -27.1 ± 7.7 | kJ/mol | Review | Martinho Simões |

Reaction thermochemistry data

Data compiled as indicated in comments:
MS - José A. Martinho Simões
ALS - Hussein Y. Afeefy, Joel F. Liebman, and Stephen E. Stein
Individual Reactions
By formula: HBr (g) + C4H9Li (l) = C4H10 (l) + BrLi (cr)
Quantity | Value | Units | Method | Reference | Comment |
---|---|---|---|---|---|
ΔrH° | -352.7 ± 2.0 | kJ/mol | RSC | Holm, 1974 | Please also see Pedley and Rylance, 1977. The reaction enthalpy was quoted from Pedley and Rylance, 1977. See Liebman, Martinho Simões, et al., 1995 for comments; MS |
C4H9Li (l) + (g) =
(g) + HLiO (cr)
By formula: C4H9Li (l) + H2O (g) = C4H10 (g) + HLiO (cr)
Quantity | Value | Units | Method | Reference | Comment |
---|---|---|---|---|---|
ΔrH° | -240.2 ± 2.9 | kJ/mol | RSC | Fowell and Mortimer, 1961 | Please also see Pedley and Rylance, 1977 and Cox and Pilcher, 1970.; MS |
By formula: C7H7Br + C4H9Li = C11H16 + BrLi
Quantity | Value | Units | Method | Reference | Comment |
---|---|---|---|---|---|
ΔrH° | -338. ± 11. | kJ/mol | Cm | Fowell and Mortimer, 1961, 2 | liquid phase; ALS |

Condensed phase thermochemistry data

Data compiled by: José A. Martinho Simões
Quantity | Value | Units | Method | Reference | Comment |
---|---|---|---|---|---|
ΔfH°liquid | -109.5 ± 3.2 | kJ/mol | Review | Martinho Simões | Selected data. |
ΔfH°liquid | -128.6 ± 3.0 | kJ/mol | Review | Martinho Simões | |
ΔfH°liquid | -134.2 ± 7.1 | kJ/mol | Review | Martinho Simões | |
Quantity | Value | Units | Method | Reference | Comment |
ΔcH°liquid | -3025.0 ± 7.1 | kJ/mol | CC-SB | Lebedev, Miroshnichenko, et al., 1962 | Please also see Cox and Pilcher, 1970. |

Phase change data

Data compiled as indicated in comments:
MS - José A. Martinho Simões
AC - William E. Acree, Jr., James S. Chickos
Quantity | Value | Units | Method | Reference | Comment |
---|---|---|---|---|---|
ΔvapH° | 107.1 ± 2.9 | kJ/mol | RSC | Lebedev, Miroshnichenko, et al., 1962 | MS |
Enthalpy of sublimation
ΔsubH (kJ/mol) | Temperature (K) | Method | Reference | Comment |
---|---|---|---|---|
109.7 | 350.5 | A | Stephenson and Malanowski, 1987 | Based on data from 333. to 368. K. See also Lebedev, Miroshnichenko, et al., 1962.; AC |

References

Martinho Simões
Martinho Simões, J.A.,
Private communication (see http://webbook.nist.gov/chemistry/om/). [all data]
Holm, 1974
Holm, T.,
J. Organometal. Chem., 1974, 77, 27. [all data]
Pedley and Rylance, 1977
Pedley, J.B.; Rylance, J.,
Computer Analysed Thermochemical Data: Organic and Organometallic Compounds, University of Sussex, Brigton, 1977. [all data]
Liebman, Martinho Simões, et al., 1995
Liebman, J.F.; Martinho Simões, J.A.; Slayden, S.W.,
In Lithium Chemistry: A Theoretical and Experimental Overview Wiley: New York, Sapse, A.-M.; Schleyer, P. von Ragué, ed(s)., 1995. [all data]
Fowell and Mortimer, 1961
Fowell, P.A.; Mortimer, C.T.,
J. Chem. Soc., 1961, 3793.. [all data]
Cox and Pilcher, 1970
Cox, J.D.; Pilcher, G.,
Thermochemistry of Organic and Organometallic Compounds
in Academic Press, New York, 1970. [all data]
Fowell and Mortimer, 1961, 2
Fowell, P.A.; Mortimer, C.T.,
735. Heats of formation and bond energies. Part V. n-Butyl-lithium,
J. Chem. Soc., 1961, 3793-3796. [all data]