Propane, 1-bromo-3-chloro-
- Formula: C3H6BrCl
- Molecular weight: 157.437
- IUPAC Standard InChIKey: MFESCIUQSIBMSM-UHFFFAOYSA-N
- CAS Registry Number: 109-70-6
- Chemical structure:
View 3d structure (requires JavaScript / HTML 5) - Other names: ω-Chlorobromopropane; Trimethylene bromide chloride; Trimethylene chlorobromide; 1-Bromo-3-chloropropane; 1-Chloro-3-bromopropane; 3-Bromo-1-chloropropane; 3-Bromopropyl chloride; 3-Chloro-1-bromopropane; 3-Chloropropyl bromide; 1,3-Chbp; UN 2688; NSC 9183

Phase change data

Data compiled as indicated in comments:
BS - Robert L. Brown and Stephen E. Stein
TRC - Thermodynamics Research Center, NIST Boulder Laboratories, Chris Muzny director
ALS - Hussein Y. Afeefy, Joel F. Liebman, and Stephen E. Stein
AC - William E. Acree, Jr., James S. Chickos
Quantity | Value | Units | Method | Reference | Comment |
---|---|---|---|---|---|
Tboil | 416. ± 1. | K | AVG | N/A | Average of 6 values; Individual data points |
Quantity | Value | Units | Method | Reference | Comment |
Tfus | 214.3 | K | N/A | Dreisbach, 1955 | Uncertainty assigned by TRC = 0.02 K; TRC |
Quantity | Value | Units | Method | Reference | Comment |
ΔvapH° | 44.06 | kJ/mol | N/A | Majer and Svoboda, 1985 | |
ΔvapH° | 44.04 ± 0.10 | kJ/mol | C | Wadso, 1968 | ALS |
Enthalpy of vaporization
ΔvapH (kJ/mol) | Temperature (K) | Method | Reference | Comment |
---|---|---|---|---|
37.55 | 416.5 | N/A | Majer and Svoboda, 1985 | |
42.0 | 341. | A | Stephenson and Malanowski, 1987 | Based on data from 326. to 488. K. See also Dykyj, 1970.; AC |

Van Den Dool and Kratz RI, non-polar column, temperature ramp

Column type | Active phase | I | Reference | Comment |
---|---|---|---|---|
Capillary | SE-54 | 869. | Weber, 1986 | 25. m/0.31 mm/0.17 μm, H2, 2. K/min; Tstart: 35. C |

Normal alkane RI, non-polar column, temperature ramp

Column type | Active phase | I | Reference | Comment |
---|---|---|---|---|
Capillary | HP-1 | 830. | Peters, de Leer, et al., 1994 | 25. m/0.2 mm/0.33 μm, He, 50. C @ 5. min, 8. K/min, 300. C @ 10. min |

Normal alkane RI, non-polar column, custom temperature program

Column type | Active phase | I | Reference | Comment |
---|---|---|---|---|
Capillary | OV-1, SE-30, Methyl silicone, SP-2100, OV-101, DB-1, etc. | 841. | Waggott and Davies, 1984 | Hydrogen; Column length: 50. m; Column diameter: 0.32 mm; Program: not specified |
Packed | Apiezon L | 869.5 | Keiko, Prokop'ev, et al., 1972 | Program: not specified |
Packed | Squalane | 849.2 | Keiko, Prokop'ev, et al., 1972 | Program: not specified |

References

Dreisbach, 1955
Dreisbach, R.R.,
Physical Properties of Chemical Compounds, Advances in Chemistry Series No. 15, Am. Chem. Soc.: Washington, D. C., 1955. [all data]
Majer and Svoboda, 1985
Majer, V.; Svoboda, V.,
Enthalpies of Vaporization of Organic Compounds: A Critical Review and Data Compilation, Blackwell Scientific Publications, Oxford, 1985, 300. [all data]
Wadso, 1968
Wadso, I.,
Heats of vaporization of organic compounds II. Chlorides, bromides, and iodides,
Acta Chem. Scand., 1968, 22, 2438. [all data]
Stephenson and Malanowski, 1987
Stephenson, Richard M.; Malanowski, Stanislaw,
Handbook of the Thermodynamics of Organic Compounds, 1987, https://doi.org/10.1007/978-94-009-3173-2
. [all data]
Dykyj, 1970
Dykyj, J.,
Petrochemica, 1970, 10, 2, 51. [all data]