Propane, 1,3-dibromo-
- Formula: C3H6Br2
- Molecular weight: 201.888
- IUPAC Standard InChIKey: VEFLKXRACNJHOV-UHFFFAOYSA-N
- CAS Registry Number: 109-64-8
- Chemical structure:
View 3d structure (requires JavaScript / HTML 5) - Other names: α,γ-Dibromopropane; ω,ω'-Dibromopropane; Trimethylene bromide; Trimethylene dibromide; 1,3-Dibromopropane; CH2BrCH2CH2Br; Dibromo-1,3 propane

Condensed phase thermochemistry data

Data compiled by: Eugene S. Domalski and Elizabeth D. Hearing
Constant pressure heat capacity of liquid
Cp,liquid (J/mol*K) | Temperature (K) | Reference | Comment |
---|---|---|---|
163.7 | 298.15 | Shehatta, 1993 | |
156.1 | 245.7 | Crowe and Smyth, 1950 | T = 117 to 246 K. Value is unsmoothed experimental datum. |
159.0 | 298. | Kurbatov, 1948 | T = 16 to 160°C, mean Cp three temperatures. |

Phase change data

Data compiled as indicated in comments:
BS - Robert L. Brown and Stephen E. Stein
TRC - Thermodynamics Research Center, NIST Boulder Laboratories, Chris Muzny director
AC - William E. Acree, Jr., James S. Chickos
ALS - Hussein Y. Afeefy, Joel F. Liebman, and Stephen E. Stein
DH - Eugene S. Domalski and Elizabeth D. Hearing
Quantity | Value | Units | Method | Reference | Comment |
---|---|---|---|---|---|
Tboil | 430. ± 70. | K | AVG | N/A | Average of 7 values; Individual data points |
Quantity | Value | Units | Method | Reference | Comment |
Tfus | 238.95 | K | N/A | Timmermans, 1952 | Uncertainty assigned by TRC = 0.6 K; TRC |
Tfus | 237.0 | K | N/A | Timmermans, 1922 | Uncertainty assigned by TRC = 0.4 K; TRC |
Tfus | 238.85 | K | N/A | Timmermans, 1921 | Uncertainty assigned by TRC = 0.5 K; TRC |
Quantity | Value | Units | Method | Reference | Comment |
Ttriple | 238.6 | K | N/A | Crowe and Smyth, 1950, 2 | Uncertainty assigned by TRC = 0.2 K; TRC |
Quantity | Value | Units | Method | Reference | Comment |
ΔvapH° | 11.34 | kcal/mol | N/A | Majer and Svoboda, 1985 | |
ΔvapH° | 11.4 | kcal/mol | GC | Carson, Laye, et al., 1994 | AC |
ΔvapH° | 11.34 ± 0.024 | kcal/mol | C | Wadso, 1968 | ALS |
ΔvapH° | 10.8 | kcal/mol | N/A | Stull, 1947 | Based on data from 283. to 440. K.; AC |
Enthalpy of vaporization
ΔvapH (kcal/mol) | Temperature (K) | Method | Reference | Comment |
---|---|---|---|---|
11.446 | 439.4 | N/A | Svoboda, Kubes, et al., 1992 | DH |
11.3 ± 0.02 | 308. | C | Svoboda, Kubes, et al., 1992 | AC |
11.2 ± 0.02 | 315. | C | Svoboda, Kubes, et al., 1992 | AC |
11.0 ± 0.02 | 323. | C | Svoboda, Kubes, et al., 1992 | AC |
10.9 ± 0.02 | 330. | C | Svoboda, Kubes, et al., 1992 | AC |
10.7 ± 0.02 | 338. | C | Svoboda, Kubes, et al., 1992 | AC |
11.1 | 322. | A | Stephenson and Malanowski, 1987 | Based on data from 307. to 437. K.; AC |
11.4 | 366. | A | Stephenson and Malanowski, 1987 | Based on data from 351. to 487. K. See also Dykyj, 1970.; AC |
Antoine Equation Parameters
log10(P) = A − (B / (T + C))
P = vapor pressure (atm)
T = temperature (K)
View plot Requires a JavaScript / HTML 5 canvas capable browser.
Temperature (K) | A | B | C | Reference | Comment |
---|---|---|---|---|---|
282.9 to 440.7 | 4.42794 | 1776.679 | -39.691 | Stull, 1947 | Coefficents calculated by NIST from author's data. |
Enthalpy of fusion
ΔfusH (kcal/mol) | Temperature (K) | Reference | Comment |
---|---|---|---|
3.499 | 238.6 | Domalski and Hearing, 1996 | AC |
3.4990 | 238.6 | Crowe and Smyth, 1950 | DH |
Entropy of fusion
ΔfusS (cal/mol*K) | Temperature (K) | Reference | Comment |
---|---|---|---|
14.7 | 238.6 | Crowe and Smyth, 1950 | DH |

Reaction thermochemistry data

Data compiled by: Hussein Y. Afeefy, Joel F. Liebman, and Stephen E. Stein
Individual Reactions
By formula: C3H6Br2 = C3H6Br2
Quantity | Value | Units | Method | Reference | Comment |
---|---|---|---|---|---|
ΔrH° | 1.13 ± 0.03 | kcal/mol | Eqk | Sharonov and Rozhnov, 1971 | liquid phase; Heat of isomerization |

Henry's Law data

Data compiled by: Rolf Sander
Henry's Law constant (water solution)
kH(T) = k°H exp(d(ln(kH))/d(1/T) ((1/T) - 1/(298.15 K)))
k°H = Henry's law constant for solubility in water at 298.15 K (mol/(kg*bar))
d(ln(kH))/d(1/T) = Temperature dependence constant (K)
k°H (mol/(kg*bar)) | d(ln(kH))/d(1/T) (K) | Method | Reference |
---|---|---|---|
1.1 | V | N/A |

Gas phase ion energetics data

Data compiled as indicated in comments:
LLK - Sharon G. Lias, Rhoda D. Levin, and Sherif A. Kafafi
RDSH - Henry M. Rosenstock, Keith Draxl, Bruce W. Steiner, and John T. Herron
Ionization energy determinations
IE (eV) | Method | Reference | Comment |
---|---|---|---|
10.07 ± 0.02 | PI | Watanabe, Nakayama, et al., 1962 | RDSH |
10.1 | PE | Kimura, Katsumata, et al., 1981 | Vertical value; LLK |
10.26 | PE | Gounelle, Menard, et al., 1975 | Vertical value; LLK |

References

Shehatta, 1993
Shehatta, I.,
Heat capacity at constant pressure of some halogen compounds,
Thermochim. Acta, 1993, 213, 1-10. [all data]
Crowe and Smyth, 1950
Crowe, R.W.; Smyth, C.P.,
Heat capacities, dielectric constants and molecular rotational freedom in solid trichloroethanes and disubstituted propanes,
J. Am. Chem. Soc., 1950, 72, 4009-4015. [all data]
Kurbatov, 1948
Kurbatov, V.Ya.,
Heat capacity of liquids. 2. Heat capacity and the temperature dependence of heat capacity from halogen derivatives of acylic hydrocarbons,
Zh. Obshch. Kim., 1948, 18, 372-389. [all data]