51-Crown-17
- Formula: C34H68O17
- Molecular weight: 748.8935
- CAS Registry Number: 109635-68-9

Phase change data

Data compiled by: William E. Acree, Jr., James S. Chickos
Enthalpy of fusion
ΔfusH (kJ/mol) | Temperature (K) | Method | Reference |
---|---|---|---|
66.6 | 301.2 | DSC | Yang, Yu, et al., 1996 |

References

Yang, Yu, et al., 1996
Yang, Zhuo; Yu, Ga-Er; Cooke, Jennifer; Ali-Adib, Ziad; Viras, Kyriakos; Matsuura, Hiroatsu; Ryan, Anthony J.; Booth, Colin,
Preparation and crystallinity of a large unsubstituted crown ether, cyclic heptacosa(oxyethylene)(cyclo-E27, 81-crown-27), studied by Raman spectroscopy, X-ray scattering and differential scanning calorimetry,
Faraday Trans., 1996, 92, 17, 3173, https://doi.org/10.1039/ft9969203173
. [all data]