Oxacycloheptadecan-2-one
- Formula: C16H30O2
- Molecular weight: 254.4082
- IUPAC Standard InChIKey: LOKPJYNMYCVCRM-UHFFFAOYSA-N
- CAS Registry Number: 109-29-5
- Chemical structure:

Phase change data

Data compiled by: William E. Acree, Jr., James S. Chickos
Enthalpy of vaporization
ΔvapH (kJ/mol) | Temperature (K) | Method | Reference | Comment |
---|---|---|---|---|
71.6 | 418. | A | Stephenson and Malanowski, 1987 | Based on data from 403. to 463. K. |

Kovats' RI, non-polar column, temperature ramp

Column type | Active phase | I | Reference | Comment |
---|---|---|---|---|
Capillary | HP-5 | 1928. | Lopes, Strobl, et al., 2004 | 30. m/0.25 mm/0.25 μm, He, 3. K/min; Tstart: 60. C; Tend: 260. C |

Kovats' RI, polar column, temperature ramp

Column type | Active phase | I | Reference | Comment |
---|---|---|---|---|
Capillary | DB-Wax | 2334. | Lopes, Strobl, et al., 2004 | 30. m/0.32 mm/0.25 μm, He, 40. C @ 5. min, 3. K/min; Tend: 220. C |

Normal alkane RI, non-polar column, temperature ramp

Column type | Active phase | I | Reference | Comment |
---|---|---|---|---|
Capillary | HP-5MS | 1912. | Tzakou, Said, et al., 2006 | 30. m/0.25 mm/0.25 μm, He, 3. K/min; Tstart: 60. C; Tend: 280. C |
Capillary | HP-5 | 1932. | Yayli, Gülec, et al., 2006 | 30. m/0.32 mm/0.25 μm, He, 60. C @ 2. min, 5. K/min, 260. C @ 14. min |

Normal alkane RI, non-polar column, custom temperature program

Column type | Active phase | I | Reference | Comment |
---|---|---|---|---|
Capillary | SLB-5 MS | 1933. | Mondello, 2012 | 30. m/0.25 mm/0.25 μm, Helium; Program: not specified |
Capillary | SLB-5 MS | 1942. | Mondello, 2012 | 30. m/0.25 mm/0.25 μm, Helium; Program: not specified |

Normal alkane RI, polar column, temperature ramp

Column type | Active phase | I | Reference | Comment |
---|---|---|---|---|
Capillary | PEG-20M | 2367. | Hirose, Joichi, et al., 1999 | N2, 3. K/min; Column length: 60. m; Column diameter: 0.25 mm; Tstart: 70. C; Tend: 220. C |

References

Stephenson and Malanowski, 1987
Stephenson, Richard M.; Malanowski, Stanislaw,
Handbook of the Thermodynamics of Organic Compounds, 1987, https://doi.org/10.1007/978-94-009-3173-2
. [all data]
Lopes, Strobl, et al., 2004
Lopes, D.; Strobl, H.; Kolodziejczyk, P.,
14-Methylpentadecano-15-lactone (Muscolide): a new macrocyclic lactone from the oil of Angelica archangelica L.,
Chemistry and Biodiversity, 2004, 1, 12, 1880-1887, https://doi.org/10.1002/cbdv.200490144
. [all data]
Tzakou, Said, et al., 2006
Tzakou, O.; Said, A.; Farag, A.; Rashed, K.,
Volatile constituents of Ailanthus excelsa Roxb.,
Flavour Fragr. J., 2006, 21, 6, 899-901, https://doi.org/10.1002/ffj.1739
. [all data]
Yayli, Gülec, et al., 2006
Yayli, N.; Gülec, C.; Ücüncü, O.; Yasar, A.; Ülker, S.; Coskuncelebi, K.; Terzioglu, S.,
Composition and Antimicrobial Activities of Volatile Components of Minuartia meyeri,
Turk. J. Chem., 2006, 30, 71-76. [all data]
Mondello, 2012
Mondello, L.,
HS-SPME-GCxGC-MS analysis of Yerba Mate (Ilex paraguariensis)
in Shimadzu GC-GC application compendium of comprehensive 2D GC, Vol. 1-5, Shimadzu Corp., 2012, 1-29. [all data]
Hirose, Joichi, et al., 1999
Hirose, S.; Joichi, A.; Nakamura, S.; Awano, K.,
Volatile components of musky scent of orchids,
Flavour Fragr. J., 1999, 14, 3, 183-184, https://doi.org/10.1002/(SICI)1099-1026(199905/06)14:3<183::AID-FFJ804>3.0.CO;2-S
. [all data]