Sodium heptamer, positive ion
- Formula: Na7+
- Molecular weight: 160.92783638
- CAS Registry Number: 109165-84-6

Ion clustering data

Data compiled by: Michael M. Meot-Ner (Mautner) and Sharon G. Lias
Clustering reactions
By formula: Na7+ + Na2 = (Na7+ • Na2)
Quantity | Value | Units | Method | Reference | Comment |
---|---|---|---|---|---|
ΔrH° | 30.2 | kcal/mol | PDiss | Brechignac, Cahuzac, et al., 1989 | gas phase |

Reaction thermochemistry data

Data compiled by: Michael M. Meot-Ner (Mautner) and Sharon G. Lias

Individual Reactions

Na7+ + Disodium = (Na7+ • Disodium)

By formula: Na7+ + Na2 = (Na7+ • Na2)

Quantity Value Units Method Reference Comment
Δr126.kJ/molPDissBrechignac, Cahuzac, et al., 1989gas phase

References

Brechignac, Cahuzac, et al., 1989
Brechignac, C.; Cahuzac, P.; Leygnier, J.; Pfalum, R.; Roux, J.P.; Weiner, J.,
Stability of Alkali Cluster Ions,
Z. Phys. D: At. Mol. Clusters, 1989, 12, 1-4, 199, https://doi.org/10.1007/BF01426937
. [all data]