Pyridine, 2-methyl-
- Formula: C6H7N
- Molecular weight: 93.1265
- IUPAC Standard InChIKey: BSKHPKMHTQYZBB-UHFFFAOYSA-N
- CAS Registry Number: 109-06-8
- Chemical structure:
View 3d structure (requires JavaScript / HTML 5) - Other names: 2-Picoline; α-Methylpyridine; α-Picoline; o-Picoline; 2-Methylpyridine; Picoline, α; Rcra waste number U191; o-Methylpyridine; NSC 3409

Henry's Law data

Data compiled by: Rolf Sander
Henry's Law constant (water solution)
kH(T) = k°H exp(d(ln(kH))/d(1/T) ((1/T) - 1/(298.15 K)))
k°H = Henry's law constant for solubility in water at 298.15 K (mol/(kg*bar))
d(ln(kH))/d(1/T) = Temperature dependence constant (K)
k°H (mol/(kg*bar)) | d(ln(kH))/d(1/T) (K) | Method | Reference | Comment |
---|---|---|---|---|
34. | Q | N/A | missing citation give several references for the Henry's law constants but don't assign them to specific species. | |
99. | 6400. | M | N/A |

Gas phase thermochemistry data

Data compiled as indicated in comments:
DRB - Donald R. Burgess, Jr.
ALS - Hussein Y. Afeefy, Joel F. Liebman, and Stephen E. Stein
Quantity | Value | Units | Method | Reference | Comment |
---|---|---|---|---|---|
ΔfH°gas | -6.33 | kcal/mol | N/A | Kosorotov, Zemlyakova, et al., 1978 | Value computed using ΔfHliquid° value of -69.0 kj/mol from Kosorotov, Zemlyakova, et al., 1978 and ΔvapH° value of 42.5 kj/mol from Scott, Hubbard, et al., 1963.; DRB |
ΔfH°gas | 23.65 ± 0.21 | kcal/mol | Ccb | Scott, Hubbard, et al., 1963 | ALS |
ΔfH°gas | 24.36 ± 0.31 | kcal/mol | Cm | Andon, Cox, et al., 1957 | ALS |
ΔfH°gas | 24.38 ± 0.31 | kcal/mol | Ccb | Cox, Challoner, et al., 1954 | ALS |
ΔfH°gas | 21.0 | kcal/mol | N/A | Constam and White, 1903 | Value computed using ΔfHliquid° value of 45.3 kj/mol from Constam and White, 1903 and ΔvapH° value of 42.5 kj/mol from Scott, Hubbard, et al., 1963.; DRB |

Condensed phase thermochemistry data

Data compiled as indicated in comments:
ALS - Hussein Y. Afeefy, Joel F. Liebman, and Stephen E. Stein
DH - Eugene S. Domalski and Elizabeth D. Hearing
Quantity | Value | Units | Method | Reference | Comment |
---|---|---|---|---|---|
ΔfH°liquid | -16.49 | kcal/mol | Ccb | Kosorotov, Zemlyakova, et al., 1978 | impure compound; ALS |
ΔfH°liquid | 13.50 ± 0.18 | kcal/mol | Ccb | Scott, Hubbard, et al., 1963 | ALS |
ΔfH°liquid | 14.10 ± 0.31 | kcal/mol | Ccb | Cox, Challoner, et al., 1954 | ALS |
ΔfH°liquid | 10.82 | kcal/mol | Ccb | Constam and White, 1903 | ALS |
Quantity | Value | Units | Method | Reference | Comment |
ΔcH°liquid | -786.91 | kcal/mol | Ccb | Kosorotov, Zemlyakova, et al., 1978 | impure compound; ALS |
ΔcH°liquid | -816.92 ± 0.16 | kcal/mol | Ccb | Scott, Hubbard, et al., 1963 | ALS |
ΔcH°liquid | -817.52 ± 0.31 | kcal/mol | Ccb | Cox, Challoner, et al., 1954 | ALS |
ΔcH°liquid | -816.1 | kcal/mol | Ccb | Constam and White, 1903 | ALS |
Quantity | Value | Units | Method | Reference | Comment |
S°liquid | 52.070 | cal/mol*K | N/A | Scott, Hubbard, et al., 1963 | DH |
Constant pressure heat capacity of liquid
Cp,liquid (cal/mol*K) | Temperature (K) | Reference | Comment |
---|---|---|---|
37.861 | 298.15 | Scott, Hubbard, et al., 1963 | T = 12 to 370 K.; DH |

Phase change data

Data compiled as indicated in comments:
BS - Robert L. Brown and Stephen E. Stein
TRC - Thermodynamics Research Center, NIST Boulder Laboratories, Chris Muzny director
AC - William E. Acree, Jr., James S. Chickos
ALS - Hussein Y. Afeefy, Joel F. Liebman, and Stephen E. Stein
DRB - Donald R. Burgess, Jr.
DH - Eugene S. Domalski and Elizabeth D. Hearing
Quantity | Value | Units | Method | Reference | Comment |
---|---|---|---|---|---|
Tboil | 402. ± 1. | K | AVG | N/A | Average of 34 out of 35 values; Individual data points |
Quantity | Value | Units | Method | Reference | Comment |
Tfus | 206. ± 3. | K | AVG | N/A | Average of 12 values; Individual data points |
Quantity | Value | Units | Method | Reference | Comment |
Ttriple | 206.46 | K | N/A | Scott, Hubbard, et al., 1963, 2 | Uncertainty assigned by TRC = 0.05 K; by extrapolation of 1/f to 0.0; TRC |
Ttriple | 206.44 | K | N/A | Helm, Lanum, et al., 1958 | Uncertainty assigned by TRC = 0.03 K; measured in calorimeter at USBM, Bartlesville, OK; TRC |
Quantity | Value | Units | Method | Reference | Comment |
Tc | 621. | K | N/A | Majer and Svoboda, 1985 | |
Tc | 621.1 | K | N/A | Kobe and Mathews, 1970 | Uncertainty assigned by TRC = 1. K; TRC |
Quantity | Value | Units | Method | Reference | Comment |
Pc | 45.40 | atm | N/A | Kobe and Mathews, 1970 | Uncertainty assigned by TRC = 0.6000 atm; TRC |
Quantity | Value | Units | Method | Reference | Comment |
ρc | 2.99 | mol/l | N/A | Kobe and Mathews, 1970 | Uncertainty assigned by TRC = 0.32 mol/l; TRC |
Quantity | Value | Units | Method | Reference | Comment |
ΔvapH° | 10.2 ± 0.2 | kcal/mol | AVG | N/A | Average of 8 values; Individual data points |
Enthalpy of vaporization
ΔvapH (kcal/mol) | Temperature (K) | Method | Reference | Comment |
---|---|---|---|---|
8.645 | 402.6 | N/A | Majer and Svoboda, 1985 | |
9.85 ± 0.02 | 320. | EB | Chirico, Knipmeyer, et al., 1999 | Based on data from 308. to 441. K.; AC |
9.27 ± 0.02 | 360. | EB | Chirico, Knipmeyer, et al., 1999 | Based on data from 308. to 441. K.; AC |
8.70 ± 0.02 | 400. | EB | Chirico, Knipmeyer, et al., 1999 | Based on data from 308. to 441. K.; AC |
8.05 ± 0.07 | 440. | EB | Chirico, Knipmeyer, et al., 1999 | Based on data from 308. to 441. K.; AC |
10.0 | 307. | EB | Lencka, 1990 | Based on data from 292. to 403. K.; AC |
11.2 | 230. | A | Stephenson and Malanowski, 1987 | Based on data from 209. to 245. K.; AC |
8.72 | 444. | A | Stephenson and Malanowski, 1987 | Based on data from 429. to 537. K.; AC |
8.46 | 536. | A | Stephenson and Malanowski, 1987 | Based on data from 521. to 621. K.; AC |
9.35 | 367. | EB,IP | Stephenson and Malanowski, 1987 | Based on data from 352. to 445. K. See also Osborn and Douslin, 1968.; AC |
9.35 | 367. | EB | Stephenson and Malanowski, 1987 | Based on data from 352. to 442. K. See also Rysselberghe and Fristrom, 1945.; AC |
9.94 ± 0.02 | 313. | C | Majer, Svoboda, et al., 1984 | AC |
9.73 ± 0.02 | 328. | C | Majer, Svoboda, et al., 1984 | AC |
9.51 ± 0.02 | 343. | C | Majer, Svoboda, et al., 1984 | AC |
9.15 ± 0.02 | 368. | C | Majer, Svoboda, et al., 1984 | AC |
9.51 | 352. | MG | Herington and Martin, 1953 | Based on data from 337. to 403. K.; AC |
9.27 ± 0.02 | 359. | C | Rysselberghe and Fristrom, 1945 | AC |
9.01 ± 0.02 | 379. | C | Rysselberghe and Fristrom, 1945 | AC |
8.65 ± 0.02 | 402. | C | Rysselberghe and Fristrom, 1945 | AC |
Enthalpy of vaporization
ΔvapH =
A exp(-βTr) (1 − Tr)β
ΔvapH =
Enthalpy of vaporization (at saturation pressure)
(kcal/mol)
Tr = reduced temperature (T / Tc)
View plot Requires a JavaScript / HTML 5 canvas capable browser.
Temperature (K) | A (kcal/mol) | β | Tc (K) | Reference | Comment |
---|---|---|---|---|---|
298. to 403. | 14.07 | 0.2879 | 621. | Majer and Svoboda, 1985 |
Antoine Equation Parameters
log10(P) = A − (B / (T + C))
P = vapor pressure (atm)
T = temperature (K)
View plot Requires a JavaScript / HTML 5 canvas capable browser.
Temperature (K) | A | B | C | Reference | Comment |
---|---|---|---|---|---|
352.94 to 441.51 | 4.13042 | 1401.681 | -63.162 | Scott, Hubbard, et al., 1963 | Coefficents calculated by NIST from author's data. |
Enthalpy of fusion
ΔfusH (kcal/mol) | Temperature (K) | Reference | Comment |
---|---|---|---|
2.3241 | 206.45 | Scott, Hubbard, et al., 1963 | DH |
2.32 | 206.5 | Domalski and Hearing, 1996 | AC |
Entropy of fusion
ΔfusS (cal/mol*K) | Temperature (K) | Reference | Comment |
---|---|---|---|
11.26 | 206.45 | Scott, Hubbard, et al., 1963 | DH |

Reaction thermochemistry data

Data compiled as indicated in comments:
B - John E. Bartmess
M - Michael M. Meot-Ner (Mautner) and Sharon G. Lias
RCD - Robert C. Dunbar
Individual Reactions
C6H6N- + =
By formula: C6H6N- + H+ = C6H7N
Quantity | Value | Units | Method | Reference | Comment |
---|---|---|---|---|---|
ΔrH° | 376.8 ± 3.1 | kcal/mol | G+TS | DePuy, Kass, et al., 1988 | gas phase; Acid: 2-methylpyridine. Between EtOH, iPrOH; B |
Quantity | Value | Units | Method | Reference | Comment |
ΔrG° | 370.0 ± 3.0 | kcal/mol | IMRB | DePuy, Kass, et al., 1988 | gas phase; Acid: 2-methylpyridine. Between EtOH, iPrOH; B |
By formula: C6H8N+ + C6H7N = (C6H8N+ • C6H7N)
Quantity | Value | Units | Method | Reference | Comment |
---|---|---|---|---|---|
ΔrH° | 23.0 | kcal/mol | PHPMS | Meot-Ner M. and Sieck, 1983 | gas phase; M |
Quantity | Value | Units | Method | Reference | Comment |
ΔrS° | 27.8 | cal/mol*K | PHPMS | Meot-Ner M. and Sieck, 1983 | gas phase; M |
By formula: Li+ + C6H7N = (Li+ • C6H7N)
Quantity | Value | Units | Method | Reference | Comment |
---|---|---|---|---|---|
ΔrH° | 46.4 ± 1.6 | kcal/mol | CIDT | Rodgers, 2001 | RCD |
By formula: Na+ + C6H7N = (Na+ • C6H7N)
Quantity | Value | Units | Method | Reference | Comment |
---|---|---|---|---|---|
ΔrH° | 30.6 ± 1.1 | kcal/mol | CIDT | Rodgers, 2001 | RCD |
By formula: K+ + C6H7N = (K+ • C6H7N)
Quantity | Value | Units | Method | Reference | Comment |
---|---|---|---|---|---|
ΔrH° | 23.4 ± 0.8 | kcal/mol | CIDT | Rodgers, 2001 | RCD |

Gas phase ion energetics data

Data evaluated as indicated in comments:
HL - Edward P. Hunter and Sharon G. Lias
Data compiled as indicated in comments:
B - John E. Bartmess
LLK - Sharon G. Lias, Rhoda D. Levin, and Sherif A. Kafafi
RDSH - Henry M. Rosenstock, Keith Draxl, Bruce W. Steiner, and John T. Herron
Quantity | Value | Units | Method | Reference | Comment |
---|---|---|---|---|---|
Proton affinity (review) | 226.8 | kcal/mol | N/A | Hunter and Lias, 1998 | HL |
Quantity | Value | Units | Method | Reference | Comment |
Gas basicity | 219.2 | kcal/mol | N/A | Hunter and Lias, 1998 | HL |
Ionization energy determinations
IE (eV) | Method | Reference | Comment |
---|---|---|---|
9.37 ± 0.05 | EI | Zaretskii, Oren, et al., 1976 | LLK |
9.4 ± 0.1 | EI | Stefanovic and Grutzmacher, 1974 | LLK |
9.02 ± 0.03 | PI | Watanabe, Nakayama, et al., 1962 | RDSH |
9.26 | PE | Kimura, Katsumata, et al., 1981 | Vertical value; LLK |
9.18 | PE | Klasinc, Novak, et al., 1978 | Vertical value; LLK |
9.20 | PE | Ramsey and Walker, 1974 | Vertical value; LLK |
9.20 ± 0.05 | PE | Heilbronner, Hornung, et al., 1972 | Vertical value; LLK |
Appearance energy determinations
Ion | AE (eV) | Other Products | Method | Reference | Comment |
---|---|---|---|---|---|
C5H6+ | 12.87 ± 0.05 | HCN | EI | Zaretskii, Oren, et al., 1976 | LLK |
C6H6N+ | 12.4 ± 0.1 | H | EI | Palmer and Lossing, 1963 | RDSH |
De-protonation reactions
C6H6N- + =
By formula: C6H6N- + H+ = C6H7N
Quantity | Value | Units | Method | Reference | Comment |
---|---|---|---|---|---|
ΔrH° | 376.8 ± 3.1 | kcal/mol | G+TS | DePuy, Kass, et al., 1988 | gas phase; Acid: 2-methylpyridine. Between EtOH, iPrOH; B |
Quantity | Value | Units | Method | Reference | Comment |
ΔrG° | 370.0 ± 3.0 | kcal/mol | IMRB | DePuy, Kass, et al., 1988 | gas phase; Acid: 2-methylpyridine. Between EtOH, iPrOH; B |

Ion clustering data

Data compiled as indicated in comments:
M - Michael M. Meot-Ner (Mautner) and Sharon G. Lias
RCD - Robert C. Dunbar
Clustering reactions
By formula: C6H8N+ + C6H7N = (C6H8N+ • C6H7N)
Quantity | Value | Units | Method | Reference | Comment |
---|---|---|---|---|---|
ΔrH° | 23.0 | kcal/mol | PHPMS | Meot-Ner M. and Sieck, 1983 | gas phase; M |
Quantity | Value | Units | Method | Reference | Comment |
ΔrS° | 27.8 | cal/mol*K | PHPMS | Meot-Ner M. and Sieck, 1983 | gas phase; M |
By formula: K+ + C6H7N = (K+ • C6H7N)
Quantity | Value | Units | Method | Reference | Comment |
---|---|---|---|---|---|
ΔrH° | 23.4 ± 0.8 | kcal/mol | CIDT | Rodgers, 2001 | RCD |
By formula: Li+ + C6H7N = (Li+ • C6H7N)
Quantity | Value | Units | Method | Reference | Comment |
---|---|---|---|---|---|
ΔrH° | 46.4 ± 1.6 | kcal/mol | CIDT | Rodgers, 2001 | RCD |
By formula: Na+ + C6H7N = (Na+ • C6H7N)
Quantity | Value | Units | Method | Reference | Comment |
---|---|---|---|---|---|
ΔrH° | 30.6 ± 1.1 | kcal/mol | CIDT | Rodgers, 2001 | RCD |

Kovats' RI, non-polar column, isothermal

View large format table.

Column type Active phase Temperature (C) I Reference Comment
PackedC78, Branched paraffin130.802.3Dallos, Sisak, et al., 2000He; Column length: 3.3 m
CapillaryOV-101110.814.Golovnya, Kuz'menko, et al., 2000He; Phase thickness: 0.4 μm
CapillaryOV-101110.804.Zhuravleva, 200050. m/0.3 mm/0.4 μm, He
PackedC78, Branched paraffin130.802.2Reddy, Dutoit, et al., 1992Chromosorb G HP; Column length: 3.3 m
CapillaryHP-160.799.Zhang, Li, et al., 1992N2; Column length: 25. m; Column diameter: 0.20 mm
CapillaryHP-160.800.Zhang, Li, et al., 1992N2; Column length: 25. m; Column diameter: 0.20 mm
PackedApolane130.803.Dutoit, 1991Column length: 3.7 m
CapillarySE-30110.804.Samusenko and Golovnya, 198825. m/0.32 mm/1. μm, He
CapillarySE-3080.800.Samusenko and Golovnya, 198825. m/0.32 mm/1. μm, He
CapillaryOV-101150.814.Morishita, Morimoto, et al., 1986N2; Column length: 20. m; Column diameter: 0.23 mm
CapillaryOV-10180.800.Samusenko, Svetlova, et al., 198625. m/0.25 mm/0.156 μm, He
CapillaryOV-10180.799.Samusenko, Svetlova, et al., 198635. m/0.25 mm/0.125 μm, He
CapillaryOV-10180.799.Samusenko, Svetlova, et al., 198635. m/0.25 mm/0.125 μm, He
CapillaryOV-10180.801.Samusenko, Svetlova, et al., 198635. m/0.25 mm/0.125 μm, He
CapillaryOV-10180.802.Samusenko, Svetlova, et al., 198650. m/0.25 mm/0.125 μm, He
CapillaryApiezon LH + KF100.816.Samusenko, Svetlova, et al., 198630. m/0.25 mm/0.063 μm, He
CapillaryApiezon LH + KF100.818.Samusenko, Svetlova, et al., 198630. m/0.25 mm/0.063 μm, He
CapillaryApiezon LH + KF100.818.Samusenko, Svetlova, et al., 198630. m/0.25 mm/0.063 μm, He
CapillaryApiezon LH + KF100.819.Samusenko, Svetlova, et al., 198630. m/0.25 mm/0.063 μm, He
CapillaryApiezon LH + KF100.819.Samusenko, Svetlova, et al., 198630. m/0.25 mm/0.063 μm, He
CapillaryApiezon LH + KF100.819.Samusenko, Svetlova, et al., 198630. m/0.25 mm/0.063 μm, He
CapillaryApiezon LH + KF100.819.Samusenko, Svetlova, et al., 198630. m/0.25 mm/0.063 μm, He
CapillaryApiezon L + KF100.816.Samusenko, Svetlova, et al., 198630. m/0.25 mm/0.063 μm, He
CapillaryApiezon L + KF100.816.Samusenko, Svetlova, et al., 198630. m/0.25 mm/0.063 μm, He
CapillaryApiezon L + KF100.816.Samusenko, Svetlova, et al., 198630. m/0.25 mm/0.063 μm, He
CapillaryApiezon L + KF100.817.Samusenko, Svetlova, et al., 198630. m/0.25 mm/0.063 μm, He
CapillaryApiezon L + KF100.818.Samusenko, Svetlova, et al., 198630. m/0.25 mm/0.063 μm, He
CapillaryApiezon L + KF100.818.Samusenko, Svetlova, et al., 198630. m/0.25 mm/0.063 μm, He
CapillaryApiezon L + KF100.818.Samusenko, Svetlova, et al., 198630. m/0.25 mm/0.063 μm, He
CapillaryApiezon L + KF100.816.Svetlova, Samusenko, et al., 198630. m/0.25 mm/0.06 μm
CapillaryApiezon L + KF100.816.Svetlova, Samusenko, et al., 198630. m/0.25 mm/0.06 μm
CapillaryApiezon L + KF100.818.Svetlova, Samusenko, et al., 198630. m/0.25 mm/0.06 μm
CapillaryApiezon L + KF100.818.Svetlova, Samusenko, et al., 198630. m/0.25 mm/0.06 μm
CapillaryApiezon L + KF100.819.Svetlova, Samusenko, et al., 198630. m/0.25 mm/0.06 μm
CapillaryApiezon L + KF100.819.Svetlova, Samusenko, et al., 198630. m/0.25 mm/0.06 μm
PackedSE-30150.820.Tiess, 1984Ar, Gas Chrom Q (80-100 mesh); Column length: 3. m
PackedApiezon L130.837.Shatts, Avots, et al., 1977He, Chromosorb W AW-DMCS; Column length: 2.4 m
PackedApolane70.786.6Riedo, Fritz, et al., 1976He, Chromosorb; Column length: 2.4 m
PackedApiezon L100.811.Zhuravleva, Kapustin, et al., 1976N2 or He, Chromosorb G, AW; Column length: 2.7 m
PackedApiezon L110.808.Bark and Wheatstone, 1974N2, Chromosorb W AW-DCMS; Column length: 2. m
PackedApiezon L130.815.Bark and Wheatstone, 1974N2, Chromosorb W AW-DCMS; Column length: 2. m
PackedApiezon L150.825.Bark and Wheatstone, 1974N2, Chromosorb W AW-DCMS; Column length: 2. m
PackedPMS-100130.799.Anderson, Jurel, et al., 1973He, Celite 545 (44-60 mesh); Column length: 3. m
PackedPMS-100150.792.Anderson, Jurel, et al., 1973He, Celite 545 (44-60 mesh); Column length: 3. m
PackedPMS-100180.792.Anderson, Jurel, et al., 1973He, Celite 545 (44-60 mesh); Column length: 3. m

Kovats' RI, polar column, isothermal

View large format table.

Column type Active phase Temperature (C) I Reference Comment
CapillaryPEG-40M110.1225.Golovnya, Samusenko, et al., 1987He; Column length: 50. m; Column diameter: 0.3 mm
CapillaryPEG-40M80.1212.Golovnya, Samusenko, et al., 1987He; Column length: 50. m; Column diameter: 0.3 mm
CapillaryPEG-20M150.1265.Morishita, Morimoto, et al., 1986N2; Column length: 20. m; Column diameter: 0.23 mm
PackedCarbowax 20M100.1222.Bark and Wheatstone, 1974N2, Chromosorb W AW-DCMS; Column length: 2. m
PackedCarbowax 20M110.1224.Bark and Wheatstone, 1974N2, Chromosorb W AW-DCMS; Column length: 2. m
PackedCarbowax 20M90.1218.Bark and Wheatstone, 1974N2, Chromosorb W AW-DCMS; Column length: 2. m
PackedPEG-2000150.1262.Anderson, Jurel, et al., 1973He, Celite 545 (44-60 mesh); Column length: 3. m
PackedPEG-2000180.1266.Anderson, Jurel, et al., 1973He, Celite 545 (44-60 mesh); Column length: 3. m

Kovats' RI, polar column, temperature ramp

View large format table.

Column type Active phase I Reference Comment
CapillaryDB-Wax1234.Yeo and Shibamoto, 1991He, 60. C @ 4. min, 4. K/min, 180. C @ 30. min; Column length: 60. m; Column diameter: 0.25 mm

Van Den Dool and Kratz RI, non-polar column, temperature ramp

View large format table.

Column type Active phase I Reference Comment
CapillaryDB-5821.Methven L., Tsoukka M., et al., 200760. m/0.32 mm/1. μm, 40. C @ 2. min, 4. K/min, 260. C @ 10. min
CapillaryCP-Sil 8CB-MS818.Hierro, de la Hoz, et al., 200460. m/0.25 mm/0.25 μm, 40. C @ 2. min, 4. K/min, 280. C @ 5. min
CapillaryBPX-5824.Ames, Guy, et al., 200150. m/0.32 mm/0.5 μm, He, 60. C @ 5. min, 4. K/min, 250. C @ 10. min
CapillaryBPX-5824.Ames, Guy, et al., 2001, 250. m/0.32 mm/0.25 μm, He, 60. C @ 5. min, 4. K/min, 250. C @ 10. min
CapillaryDB-1792.Kim, 200160. m/0.32 mm/1. μm, He, 40. C @ 5. min, 2. K/min; Tend: 220. C
CapillaryCP Sil 8 CB811.Chevance and Farmer, 199960. C @ 5. min, 4. K/min, 220. C @ 30. min; Column length: 50. m; Column diameter: 0.32 mm
CapillaryOV-1790.0Gautzsch and Zinn, 19968. K/min; Tstart: 35. C; Tend: 300. C
CapillaryDB-1787.Izzo and Ho, 199150. m/0.32 mm/1.05 μm, He, 2. K/min, 260. C @ 40. min; Tstart: 40. C
CapillaryOV-101805.Golovnya, Samusenko, et al., 1988He, 2. K/min; Column length: 50. m; Column diameter: 0.25 mm; Tstart: 100. C
CapillaryOV-101802.Golovnya, Samusenko, et al., 1988He, 8. K/min; Column length: 50. m; Column diameter: 0.25 mm; Tstart: 70. C
CapillaryOV-101803.Golovnya, Samusenko, et al., 1988He, 4. K/min; Column length: 50. m; Column diameter: 0.25 mm; Tstart: 80. C
CapillaryDB-1787.Zhang, Chien, et al., 198860. m/0.25 mm/0.25 μm, He, 2. K/min, 220. C @ 10. min; Tstart: 40. C
CapillaryDB-5814.Premecz and Ford, 1987He, 60. C @ 10. min, 10. K/min, 280. C @ 3. min; Column length: 30. m; Column diameter: 0.32 mm
CapillaryDB-5807.Rostad and Pereira, 198630. m/0.26 mm/0.25 μm, He, 50. C @ 4. min, 6. K/min, 300. C @ 20. min

Van Den Dool and Kratz RI, non-polar column, custom temperature program

View large format table.

Column type Active phase I Reference Comment
CapillaryCP-Sil 8CB-MS821.Elmore, Mottram, et al., 200060. m/0.25 mm/0.25 μm, He; Program: 0C(5min) => 40C/min => 40C (2min) => 4C/min => 280C

Van Den Dool and Kratz RI, polar column, temperature ramp

View large format table.

Column type Active phase I Reference Comment
CapillaryCP-Wax 52CB1211.Mahadevan and Farmer, 200660. C @ 5. min, 4. K/min, 220. C @ 30. min; Column length: 50. m; Column diameter: 0.32 mm
CapillaryCP-Wax 52CB1213.Mahadevan and Farmer, 200660. C @ 5. min, 4. K/min, 220. C @ 30. min; Column length: 50. m; Column diameter: 0.32 mm
CapillarySupelcowax-101213.Chung, Yung, et al., 200260. m/0.25 mm/0.25 μm, He, 35. C @ 5. min, 2. K/min, 195. C @ 90. min
CapillarySupelcowax-101213.Chung, Yung, et al., 200160. m/0.25 mm/0.25 μm, He, 35. C @ 5. min, 2. K/min, 195. C @ 90. min
CapillaryDB-Wax1214.Kim, 200160. m/0.25 mm/0.25 μm, He, 40. C @ 5. min, 2. K/min, 200. C @ 30. min
CapillaryCP-Wax 52CB1206.Chevance and Farmer, 199960. C @ 5. min, 4. K/min, 220. C @ 30. min; Column length: 50. m; Column diameter: 0.32 mm
CapillarySupelcowax-101214.Chung, 199960. m/0.25 mm/0.25 μm, He, 35. C @ 5. min, 2. K/min, 195. C @ 90. min
CapillarySupelcowax-101211.Chung, 1999, 260. m/0.25 mm/0.25 μm, He, 35. C @ 5. min, 2. K/min, 195. C @ 90. min
CapillaryDB-Wax1216.Shimoda, Shiratsuchi, et al., 199660. m/0.25 mm/0.25 μm, He, 2. K/min, 230. C @ 60. min; Tstart: 50. C
CapillaryDB-Wax1227.Chung, Eiserich, et al., 1994He, 60. C @ 4. min, 3. K/min, 220. C @ 30. min; Column length: 60. m; Column diameter: 0.25 mm
CapillaryCP-Wax 52CB1200.Yu, Wu, et al., 199350. m/0.32 mm/0.25 μm, H2, 40. C @ 10. min, 1.5 K/min, 200. C @ 60. min
CapillaryPEG-40M1226.Golovnya, Samusenko, et al., 198825. m/0.32 mm/0.80 μm, He, 2. K/min; Tstart: 100. C
CapillaryPEG-40M1223.Golovnya, Samusenko, et al., 198825. m/0.32 mm/0.80 μm, He, 8. K/min; Tstart: 70. C
CapillaryPEG-40M1226.Golovnya, Samusenko, et al., 198825. m/0.32 mm/0.80 μm, He, 8. K/min; Tstart: 70. C
CapillaryPEG-40M1222.Golovnya, Samusenko, et al., 198825. m/0.32 mm/0.80 μm, He, 4. K/min; Tstart: 80. C
CapillaryCP-WAX 57CB1242.Salter L.J., Mottram D.S., et al., 198860. C @ 5. min, 4. K/min; Column length: 50. m; Column diameter: 0.32 mm; Tend: 200. C
CapillaryCP-WAX 57CB1242.Whitfield, Mottram, et al., 1988He, 60. C @ 5. min, 4. K/min, 200. C @ 10. min; Column length: 50. m; Column diameter: 0.32 mm
CapillaryCP-WAX 57CB1242.Whitfield, Mottram, et al., 1988He, 60. C @ 5. min, 4. K/min, 200. C @ 10. min; Column length: 50. m; Column diameter: 0.32 mm
CapillaryCAM1215.677Premecz and Ford, 1987He, 60. C @ 5. min, 5. K/min, 240. C @ 21. min; Column length: 15. m; Column diameter: 0.24 mm

Van Den Dool and Kratz RI, polar column, custom temperature program

View large format table.

Column type Active phase I Reference Comment
CapillaryFFAP1190.Yasuhara, 198750. m/0.25 mm/0.25 μm, He; Program: 20C (5min) => 2C/min => 70C => 4C/min => 210C

Normal alkane RI, non-polar column, temperature ramp

View large format table.

Column type Active phase I Reference Comment
CapillaryZB-5826.Harrison and Priest, 200930. m/0.25 mm/0.25 μm, Helium, 40. C @ 1. min, 6. K/min, 280. C @ 9. min
CapillaryHP-5820.0Leffingwell and Alford, 200560. m/0.32 mm/0.25 μm, He, 30. C @ 2. min, 2. K/min, 260. C @ 28. min
CapillarySPB-5815.Poligné, Collignan, et al., 200160. m/0.32 mm/1. μm, He, 3. K/min; Tstart: 40. C; Tend: 200. C
CapillaryHP-5816.Kubec, Drhová, et al., 199930. m/0.25 mm/0.25 μm, N2, 40. C @ 3. min, 4. K/min, 240. C @ 10. min
CapillaryDB-1799.Chen and Ho, 199860. m/0.32 mm/1.0 μm, He, 3. K/min; Tstart: 40. C; Tend: 260. C
CapillaryHP-5816.Kubec, Drhová, et al., 199830. m/0.25 mm/0.25 μm, N2, 40. C @ 3. min, 4. K/min, 240. C @ 10. min
CapillaryDB-1797.Yu, Wu, et al., 199460. m/0.25 mm/1. μm, He, 40. C @ 5. min, 2. K/min, 260. C @ 60. min
CapillaryDB-1799.Yu, Wu, et al., 1994, 260. m/0.25 mm/1. μm, He, 40. C @ 5. min, 2. K/min, 260. C @ 60. min
CapillaryDB-1799.Yu, Wu, et al., 1994, 260. m/0.25 mm/1. μm, He, 40. C @ 5. min, 2. K/min, 260. C @ 60. min
CapillaryDB-1770.Ishihara, Tsuneya, et al., 199260. m/0.25 mm/0.25 μm, He, 50. C @ 5. min, 3. K/min; Tend: 240. C
CapillaryDB-1772.Ishihara, Tsuneya, et al., 199260. m/0.25 mm/0.25 μm, He, 50. C @ 5. min, 3. K/min; Tend: 240. C
CapillaryOV-101799.Misharina, Golovnya, et al., 199150. m/0.32 mm/0.5 μm, He, 4. K/min; Tstart: 50. C; Tend: 250. C

Normal alkane RI, non-polar column, custom temperature program

View large format table.

Column type Active phase I Reference Comment
CapillaryCP Sil 5 CB800.Counet, Callemien, et al., 200250. m/0.32 mm/1.2 μm; Program: 36C => 20C/min => 85C => 1C/min => 145C=3C/min => 250C(30min)
CapillarySE-30825.Li, Gao, et al., 2000Program: not specified
CapillaryDB-1795.Kawai, Ishida, et al., 199160. m/0.25 mm/0.25 μm; Program: not specified
CapillaryDB-1798.Kawai, Ishida, et al., 199160. m/0.25 mm/0.25 μm; Program: not specified

Normal alkane RI, polar column, temperature ramp

View large format table.

Column type Active phase I Reference Comment
CapillaryHP-Innowax1205.Puvipirom and Chaisei, 201215. m/0.32 mm/0.50 μm, Helium, 3. K/min; Tstart: 40. C; Tend: 250. C
CapillaryDB-Wax1240.Moon and Shibamoto, 200960. m/0.25 mm/0.50 μm, Helium, 40. C @ 5. min, 2. K/min, 210. C @ 70. min
CapillaryFFAP1243.Nebesny, Budryn, et al., 200730. m/0.32 mm/0.5 μm, N2, 35. C @ 5. min, 4. K/min, 320. C @ 45. min
CapillaryTC-Wax1240.Ishizaki, Tachihara, et al., 200560. m/0.25 mm/0.25 μm, N2, 3. K/min, 220. C @ 40. min; Tstart: 70. C
CapillaryTC-Wax1234.Ishikawa, Ito, et al., 200460. m/0.25 mm/0.5 μm, He, 40. C @ 8. min, 3. K/min; Tend: 230. C
CapillaryTC-Wax1234.Fukami, Ishiyama, et al., 200260. m/0.25 mm/0.25 μm, He, 2. K/min; Tstart: 50. C; Tend: 230. C
CapillaryRTX-Wax1241.Galindo-Cuspinera, Lubran, et al., 200260. m/0.25 mm/0.5 μm, He, 40. C @ 5. min, 5. K/min, 180. C @ 20. min
CapillaryHP-Wax1239.Sanz, Maeztu, et al., 200260. m/0.25 mm/0.5 μm, He, 40. C @ 6. min, 3. K/min; Tend: 190. C
CapillaryHP-Wax1239.Maeztu, Sanz, et al., 200160. m/0.25 mm/0.5 μm, He, 40. C @ 6. min, 3. K/min; Tend: 190. C
CapillaryHP-Wax1239.Sanz, Ansorena, et al., 200160. m/0.25 mm/0.5 μm, He, 40. C @ 6. min, 3. K/min; Tend: 190. C
CapillaryHP-Innowax1219.Kubec, Drhová, et al., 199930. m/0.25 mm/0.25 μm, He, 40. C @ 3. min, 4. K/min, 190. C @ 10. min
CapillaryDB-Wax1214.Horiuchi, Umano, et al., 199860. m/0.25 mm/1. μm, He, 3. K/min, 200. C @ 40. min; Tstart: 50. C
CapillaryHP-Innowax1219.Kubec, Drhová, et al., 199830. m/0.25 mm/0.25 μm, N2, 40. C @ 3. min, 4. K/min, 190. C @ 10. min
CapillaryPEG-20M1182.Kubota, Matsujage, et al., 199650. m/0.25 mm/0.25 μm, Nitrogen, 2. K/min; Tstart: 60. C; Tend: 180. C
CapillaryDB-Wax1216.Umano, Hagi, et al., 1995He, 40. C @ 2. min, 2. K/min; Column length: 60. m; Column diameter: 0.25 mm; Tend: 200. C
CapillaryCarbowax 20M1220.Seifert and King, 1982He, 50. C @ 10. min, 1. K/min, 170. C @ 60. min; Column length: 150. m; Column diameter: 0.64 mm
CapillaryCarbowax 20M1210.Liardon and Ledermann, 1980H2, 2. K/min; Column length: 39. m; Column diameter: 0.30 mm; Tstart: 60. C; Tend: 220. C

Normal alkane RI, polar column, custom temperature program

View large format table.

Column type Active phase I Reference Comment
CapillaryDB-Wax1229.Gonzalez-Rios, Suarez-Quiroz, et al., 200730. m/0.25 mm/0.25 μm, Hydrogen; Program: 44 0C 3 0C/min -> 170 0C 8 0C/min -> 250 0C
CapillaryDB-Wax1239.Gonzalez-Rios, Suarez-Quiroz, et al., 200730. m/0.25 mm/0.25 μm, Hydrogen; Program: not specified
CapillaryTC-Wax1240.Kraft and Switt, 2005Program: not specified
CapillaryDB-Wax1216.Kim. J.H., Ahn, et al., 200460. m/0.25 mm/0.25 μm, Helium; Program: 60 0C (3 min) 2 0C/min -> 150 0C 4 0C/min -> 200 0C
CapillaryTC-Wax1240.Tachihara, Ishizaki, et al., 2004Program: not specified
CapillaryDB-Wax1210.Peng, Yang, et al., 1991Program: not specified
CapillaryCarbowax1209.Baltes and Bochmann, 1987Program: not specified
CapillaryCarbowax1209.Baltes and Bochmann, 1987Program: not specified
CapillaryCarbowax1209.Baltes and Bochmann, 1987Program: not specified
CapillaryCarbowax1210.Baltes and Bochmann, 1987Program: not specified
CapillaryCarbowax1210.Baltes and Bochmann, 1987Program: not specified
CapillaryCarbowax1211.Baltes and Bochmann, 1987Program: not specified
CapillaryCarbowax1212.Baltes and Bochmann, 1987Program: not specified
CapillarySuperox 0.6; Carbowax 20M1180.Waggott and Davies, 1984Hydrogen; Column length: 50. m; Column diameter: 0.32 mm; Program: not specified
CapillaryCarbowax 400, Carbowax 20M, Carbowax 1540, Carbowax 4000, Superox 06, PEG 20M, etc.1180.Waggott and Davies, 1984Hydrogen; Column length: 50. m; Column diameter: 0.32 mm; Program: not specified

Lee's RI, non-polar column, temperature ramp

View large format table.

Column type Active phase I Reference Comment
CapillaryDB-5MS121.17Chen, Keeran, et al., 200230. m/0.25 mm/0.5 μm, 40. C @ 1. min, 10. K/min; Tend: 310. C
CapillaryDB-5MS130.12Chen, Keeran, et al., 200230. m/0.25 mm/0.5 μm, 40. C @ 1. min, 4. K/min; Tend: 310. C
CapillaryDB-5125.11Rostad and Pereira, 198630. m/0.26 mm/0.25 μm, He, 50. C @ 4. min, 6. K/min, 300. C @ 20. min

References

No reference data available.