Piperazine, 1-methyl-
- Formula: C5H12N2
- Molecular weight: 100.1622
- IUPAC Standard InChIKey: PVOAHINGSUIXLS-UHFFFAOYSA-N
- CAS Registry Number: 109-01-3
- Chemical structure:
View 3d structure (requires JavaScript / HTML 5) - Other names: N-Methylpiperazine; 1-Methylpiperazine

Phase change data

Data compiled as indicated in comments:
BS - Robert L. Brown and Stephen E. Stein
TRC - Thermodynamics Research Center, NIST Boulder Laboratories, Chris Muzny director
AC - William E. Acree, Jr., James S. Chickos
Quantity | Value | Units | Method | Reference | Comment |
---|---|---|---|---|---|
Tboil | 411.2 | K | N/A | Weast and Grasselli, 1989 | BS |
Tboil | 410.65 | K | N/A | Lanum and Morris, 1969 | Uncertainty assigned by TRC = 0.3 K; TRC |
Quantity | Value | Units | Method | Reference | Comment |
Tfus | 267.82 | K | N/A | Lanum and Morris, 1969 | Uncertainty assigned by TRC = 0.2 K; TRC |
Tfus | 266.8 | K | N/A | Anonymous, 1957 | Uncertainty assigned by TRC = 0.6 K; TRC |
Enthalpy of vaporization
ΔvapH (kJ/mol) | Temperature (K) | Method | Reference | Comment |
---|---|---|---|---|
46.7 | 289. | A | Stephenson and Malanowski, 1987 | Based on data from 274. to 319. K.; AC |

Kovats' RI, non-polar column, isothermal

View large format table.

Column type Active phase Temperature (C) I Reference Comment
PackedPMS-100130.852.Anderson, Jurel, et al., 1973He, Celite 545 (44-60 mesh); Column length: 3. m
PackedPMS-100150.847.Anderson, Jurel, et al., 1973He, Celite 545 (44-60 mesh); Column length: 3. m
PackedPMS-100180.839.Anderson, Jurel, et al., 1973He, Celite 545 (44-60 mesh); Column length: 3. m

Kovats' RI, polar column, isothermal

View large format table.

Column type Active phase Temperature (C) I Reference Comment
PackedPEG-2000150.1266.Anderson, Jurel, et al., 1973He, Celite 545 (44-60 mesh); Column length: 3. m
PackedPEG-2000152.1270.Anderson, Jurel, et al., 1973He, Celite 545 (44-60 mesh); Column length: 3. m
PackedPEG-2000179.1282.Anderson, Jurel, et al., 1973He, Celite 545 (44-60 mesh); Column length: 3. m
PackedPEG-2000180.1274.Anderson, Jurel, et al., 1973He, Celite 545 (44-60 mesh); Column length: 3. m
PackedPEG-2000200.1282.Anderson, Jurel, et al., 1973He, Celite 545 (44-60 mesh); Column length: 3. m
PackedPEG-2000200.1286.Anderson, Jurel, et al., 1973He, Celite 545 (44-60 mesh); Column length: 3. m

Normal alkane RI, polar column, custom temperature program

View large format table.

Column type Active phase I Reference Comment
CapillaryDB-Wax1262.Peng, Yang, et al., 1991Program: not specified

References

Weast and Grasselli, 1989
CRC Handbook of Data on Organic Compounds, 2nd Editon, Weast,R.C and Grasselli, J.G., ed(s)., CRC Press, Inc., Boca Raton, FL, 1989, 1. [all data]
Lanum and Morris, 1969
Lanum, W.J.; Morris, J.C.,
Physical Properties of Some Sulfur and Nitrogen Compounds,
J. Chem. Eng. Data, 1969, 14, 93-8. [all data]
Anonymous, 1957
Anonymous, R.,
, Am. Pet. Inst. Res. Proj. 6, Carnegie-Mellon Univ., 1957. [all data]
Stephenson and Malanowski, 1987
Stephenson, Richard M.; Malanowski, Stanislaw,
Handbook of the Thermodynamics of Organic Compounds, 1987, https://doi.org/10.1007/978-94-009-3173-2
. [all data]